γ-Muurolene

Normal alkane RI, non-polar column, custom temperature program

Data compiled by: NIST Mass Spectrometry Data Center, William E. Wallace, director

Column type CapillaryCapillaryCapillaryCapillaryCapillary
Active phase DB-1RTX-1RTX-1HP-55 % Phenyl polydimethyl siloxane
Column length (m) 30.60.60.25.
Carrier gas HydrogenHeliumHeliumHydrogen
Substrate
Column diameter (mm) 0.250.220.220.32
Phase thickness (μm) 0.250.250.250.52
Program 45 0C 3 0C/min -> 175 0C 15 0C/min -> 300 0C (10 min)not specifiednot specifiednot specifiednot specified
I 1469.1471.1471.1480.1476.
ReferenceAlbano, Lima, et al., 2012Bendiabdellah, El Amine Dib, et al., 2012Bendiabdellah, El Amine Dib, et al., 2012Velickovic, Ristic, et al., 2012Chaverri, Diaz, et al., 2011
Comment MSDC-RI MSDC-RI MSDC-RI MSDC-RI MSDC-RI
Column type CapillaryCapillaryCapillaryCapillaryCapillary
Active phase HP-5HP-5HP-5 MSZB-1 MSHP-5
Column length (m)   30.30.30.
Carrier gas   HeliumHeliumHelium
Substrate
Column diameter (mm)   0.250.250.32
Phase thickness (μm)   0.250.250.25
Program not specifiednot specified40 0C (10 min) 3 0C/min -> 200 0C 2 0C/min -> 220 0C50 0C 3 0C/min -> 150 0C (10 min) 10 0C/min -> 250 0Cnot specified
I 1474.1475.1479.1435.1480.
ReferenceCitron, Riclea, et al., 2011Citron, Riclea, et al., 2011Nance and Setzer, 2011Al-Reza, Rahman, et al., 2010Kahriman, Tosun, et al., 2010
Comment MSDC-RI MSDC-RI MSDC-RI MSDC-RI MSDC-RI
Column type CapillaryCapillaryCapillaryCapillaryCapillary
Active phase DB-1-MSDB-1DB-5HP-5HP-5
Column length (m) 60.30.30.25.25.
Carrier gas HeliumHeliumHeliumHeliumHelium
Substrate
Column diameter (mm) 0.250.250.250.320.32
Phase thickness (μm) 0.250.250.250.170.17
Program not specifiednot specified50 0C m6 0C/min -> 140 0C 5 0C/min -> 160 0C (1 min) 10 0C/min -> 200 0C60 0C (5 min) 4 0C/min -> 220 0C 11 0C/min -> 280 0C (15 min)not specified
I 1469.1466.1480.1477.1479.
ReferenceTakeoka, Hobbs, et al., 2010Xu, Tang, et al., 2010Courtois, Paine, et al., 2009Custer, 2009Custer, 2009
Comment MSDC-RI MSDC-RI MSDC-RI MSDC-RI MSDC-RI
Column type CapillaryCapillaryCapillaryCapillaryCapillary
Active phase DB-1RTX-5RTX-5HP-5 MSDB-1
Column length (m) 60.30.30.30.30.
Carrier gas HeliumNitrogenNitrogenHeliumHydrogen
Substrate
Column diameter (mm) 0.250.250.250.250.25
Phase thickness (μm) 0.250.250.250.250.25
Program 50 0C (5 min) 3 0C/min -> 120 0C 5 0C/min -> 250 0C (3 min) 15 0C/min -> 300 0C (20 min)60 0C 95 min) 110 0C 3 0C/min -> 200 0C 5 0C/min -> 220 0C 95 min)not specified40 0C (5 min) 2 0C/min -> 270 0C -> 260 0C (20 min)45 0C 3 0C/min -> 175 0C 15 0C/min -> 300 0C (10 min)
I 1484.1486.1480.1478.1469.
ReferenceDelort and Jaquier, 2009Leela, Vipin, et al., 2009Leela, Vipin, et al., 2009Mancini, Arnold, et al., 2009Mendes, Trindade, et al., 2009
Comment MSDC-RI MSDC-RI MSDC-RI MSDC-RI MSDC-RI
Column type CapillaryCapillaryCapillaryCapillaryCapillary
Active phase DB-1DB-5DB-5 MSDB-5DB-5
Column length (m) 30.30.30.30.30.
Carrier gas HydrogenHeliumHeliumHydrogenHelium
Substrate
Column diameter (mm) 0.250.250.250.250.25
Phase thickness (μm) 0.250.250.250.250.25
Program 45 0C 3 0C/min -> 175 0C 15 0C/min -> 300 0C (10 min)not specifiednot specified35 0C 4 0C/min -> 180 0C 17 0C/min -> 280 0C (10 min)35 0C 1 0C/min -> 60 0C 3 0C/min -> 170 0C 8 0C/min -> 200 0C 15 0C/min -> 280 0C (5 min)
I 1469.1475.1454.1480.1471.
ReferenceMendes, Trindade, et al., 2009, 2Porto, Decorti, et al., 2009Su, Wang, et al., 2009de Albuquerque, Alves, et al., 2008Gazim, Rezende, et al., 2008
Comment MSDC-RI MSDC-RI MSDC-RI MSDC-RI MSDC-RI
Column type CapillaryCapillaryCapillaryCapillaryCapillary
Active phase DB-5DB-5DB-5DB-5DB-5
Column length (m) 30.30.30.30.30.
Carrier gas HeliumHeliumHeliumHeliumHelium
Substrate
Column diameter (mm) 0.250.250.250.250.25
Phase thickness (μm) 0.250.250.250.250.25
Program 35 0C 1 0C/min -> 60 0C 3 0C/min -> 170 0C 8 0C/min -> 200 0C 15 0C/min -> 280 0C (5 min)35 0C 1 0C/min -> 60 0C 3 0C/min -> 170 0C 8 0C/min -> 200 0C 15 0C/min -> 280 0C (5 min)not specifiednot specifiednot specified
I 1472.1474.1477.1477.1477.
ReferenceGazim, Rezende, et al., 2008Gazim, Rezende, et al., 2008Gazim, Rezende, et al., 2008Gazim, Rezende, et al., 2008Gazim, Rezende, et al., 2008
Comment MSDC-RI MSDC-RI MSDC-RI MSDC-RI MSDC-RI
Column type CapillaryCapillaryCapillaryCapillaryCapillary
Active phase SPB-5SPB-5CP Sil 8 CBCP Sil 8 CBSLB-5 MS
Column length (m)   30.50.30.
Carrier gas    HeliumHelium
Substrate
Column diameter (mm)   0.250.320.25
Phase thickness (μm)   0.250.250.25
Program not specifiednot specified60C => 2.5C/min => 170C => 10C/min => 250C (5min)not specifiednot specified
I 1478.1482.1477.1480.1472.
ReferenceKilani, Ledauphin, et al., 2008Kilani, Ledauphin, et al., 2008Kristiawan, Sobolik, et al., 2008Kupcinskiene, Stikliene, et al., 2008Lo Presti, Sciarrone, et al., 2008
Comment MSDC-RI MSDC-RI MSDC-RI MSDC-RI MSDC-RI
Column type CapillaryCapillaryCapillaryCapillaryCapillary
Active phase HP-5MSDB-1CP-Sil 8CB-MSElite-1DB-5 MS
Column length (m) 30.30.30.30.30.
Carrier gas HeHeHeliumHelium
Substrate
Column diameter (mm) 0.250.250.250.320.25
Phase thickness (μm) 0.250.250.250.250.25
Program 40 0C (2 min) 3 0C/min -> 180 0C (2 min) 15 0C -> 280 0C45C => 3C/min => 175C => 15C/min => 300C (10min)50 0C(3 min) 3 0C/min -> 100 0C 2.7 0C/min -> 140 0C 2.4 0C/min -> 180 0C 6 0C/min -> 260 0Cnot specified80 0C (1.5 min) 4 pC/min -> 180 0C 10 0C/min -> 300 0C (10 min)
I 1451.1469.1477.1480.1479.
ReferenceNing, Zheng, et al., 2008Nogueira, Marcelo-Curto, et al., 2008Profitt, Schatz, et al., 2008Raj, Baby, et al., 2008Silva, Doria, et al., 2008
Comment MSDC-RI MSDC-RI MSDC-RI MSDC-RI MSDC-RI
Column type CapillaryCapillaryCapillaryCapillaryCapillary
Active phase RTX-5RTX-55 % Phenyl methyl siloxaneHP-5MSHP-5 MS
Column length (m) 30.30. 30.30.
Carrier gas HeliumHelium HeHelium
Substrate
Column diameter (mm) 0.250.25 0.250.25
Phase thickness (μm) 0.250.25 0.250.25
Program 60 0C (5 min) 5 0C/min -> 110 0C 3 0C/min -> 220 0C (5 min)not specifiednot specified40C(10min) => 3C/min => 200C => 2C/min => 220C40 0C (10 min) 3 0C/min -> 200 0C 2 0C/min -> 220 0C
I 1482.1480.1508.1477.1477.
ReferenceZachariah, Leela, et al., 2008Zachariah, Leela, et al., 2008Agabriel, Cornu, et al., 2007Cole, Haber, et al., 2007Eason and Setzer, 2007
Comment MSDC-RI MSDC-RI MSDC-RI MSDC-RI MSDC-RI
Column type CapillaryCapillaryCapillaryCapillaryCapillary
Active phase HP-5MSCP Sil 8 CBCP Sil 8 CBHP-5 MSDB-5
Column length (m) 30.30.50.30.50.
Carrier gas HeHeHeHeliumHelium
Substrate
Column diameter (mm) 0.250.250.320.250.32
Phase thickness (μm) 0.250.250.250.250.25
Program 40C(5min) => 2C/min => 250C(15min) => 10C/min => 270C50C(3min) => 3C/min => 100C => 2.7C/min => 140C => 2.4C/min => 180C => 6C/min => 250C60 0C (2 min) 5 0C/min -> 160 0C 5 0C/min -> 250 0C (10 min)40 0C (10 min) 3 0C/min -> 200 0C 2 0C/min -> 220 0C60 0C (1 min) 5 0C/min -> 160 0C 10 0C/min -> 250 0C
I 1478.1474.1480.1478.1480.
ReferenceFormisano, Mignola, et al., 2007Meekijjaroenroj, Bessière, et al., 2007Mockute, Bernotiene, et al., 2007Moriarity, Bansal, et al., 2007Nivinsliene, Butkiene, et al., 2007
Comment MSDC-RI MSDC-RI MSDC-RI MSDC-RI MSDC-RI
Column type CapillaryCapillaryCapillaryCapillaryCapillary
Active phase DB-5DB-5CP-SilCP-SilCP-Sil
Column length (m) 30.30.30.30.30.
Carrier gas HeHydrogenHeliumHeliumHelium
Substrate
Column diameter (mm) 0.250.250.250.250.25
Phase thickness (μm) 0.250.250.250.250.25
Program 50C(1min) => 3C/min => 250C(10min) => 20C/min => 280C (5min)not specified50 0C (3 min) 3 0C/min -> 100 0C 2.7 0C/min -> 140 0C 2.4 0C/min -> 180 0C 6 0C/min -> 250 0C50 0C (3 min) 3 0C/min -> 100 0C 2.7 0C/min -> 140 0C 2.4 0C/min -> 180 0C 6 0C/min -> 250 0C50 0C (3 min) 3 0C/min -> 100 0C 2.7 0C/min -> 140 0C 2.4 0C/min -> 180 0C 6 0C/min -> 250 0C
I 1465.1477.1451.1477.1477.
ReferenceParker, Pollnitz, et al., 2007Pontes, de Olivera, et al., 2007Proffit, 2007Proffit, 2007Proffit, 2007
Comment MSDC-RI MSDC-RI MSDC-RI MSDC-RI MSDC-RI
Column type CapillaryCapillaryCapillaryCapillaryCapillary
Active phase CP Sil 8 CBHP-55 % Phenyl methylsiloxaneHP-5 MSHP-5MS
Column length (m) 50.30. 30.30.
Carrier gas HeliumHelium HeliumHe
Substrate
Column diameter (mm) 0.320.25 0.250.25
Phase thickness (μm) 0.250.25  0.25
Program 60 0C (2 min) 5 0C/min -> 160 0C (1 min) 10 0C/min -> 280 0C (3 min)not specifiednot specified40 0C (10 min) 3 oC/min -> 200 0C 2 0C/min -> 220 0C50C(2min) => 6C/min => 200C => 10C/min => 270C(10min)
I 1480.1480.1504.1476.1463.
ReferenceRadusiene, Judzentiene, et al., 2007Ristic, Krivokuca-Dokic, et al., 2007Serrano, Cornu, et al., 2007Setzer, Stokes, et al., 2007Deng, Xu, et al., 2006
Comment MSDC-RI MSDC-RI MSDC-RI MSDC-RI MSDC-RI
Column type CapillaryCapillaryCapillaryCapillaryCapillary
Active phase HP-5MSCP Sil 8 CBDB-1HP-5 MSHP-5 MS
Column length (m) 30.50.30.30.30.
Carrier gas HeHeHeHeliumHelium
Substrate
Column diameter (mm) 0.250.320.250.250.25
Phase thickness (μm) 0.250.25 0.250.25
Program 40C(5min) => 2C/min => 250C(15min) => 10C/min => 270C60C(2min) => 5C/min => 160C(1min) => 10C/min => 250C (5min)35C => 4C/min => 180C => 10C/min => 250C40 0C (10 min) 3 0C/min -> 200 0C 2 0C/min -> 220 0C40 0C (10 min) 3 0C/min -> 200 0C 2 0C/min -> 220 0C
I 1478.1480.1480.1477.1478.
ReferenceFormisano C., Senatore F., et al., 2006Judzentiene and Buzelyte, 2006de Lima, Maia, et al., 2006Schmidt, Noletto, et al., 2006Schmidt, Noletto, et al., 2006
Comment MSDC-RI MSDC-RI MSDC-RI MSDC-RI MSDC-RI
Column type CapillaryCapillaryCapillaryCapillaryCapillary
Active phase HP-5MSDB-5SE-52CP Sil 8 CBDB-5
Column length (m) 30.30.30.50.30.
Carrier gas HeHeHeHeHe
Substrate
Column diameter (mm) 0.250.320.320.320.25
Phase thickness (μm) 0.250.250.150.250.25
Program 40C(5min) => 2C/min => 250C (15min) => 10C/min => 270C60C => 2C/min => 100C => 3C/min => 160C => 5C/min => 280C45C => 1C/min => 100C => 5C/min => 250C (10min)50C(5min) => 2C/min => 90C => 15C/min => 240C(4min)35C => 4C/min => 180C => 10C/min => 250C
I 1477.1476.1480.1478.1479.
ReferenceSenatore, Apostolides Arnold, et al., 2006Srivastava, Mallavarapu, et al., 2006Tognolini, Barocelli, et al., 2006Butkienë, Nivinskienë, et al., 2005Cysne, Canuto, et al., 2005
Comment MSDC-RI MSDC-RI MSDC-RI MSDC-RI MSDC-RI
Column type CapillaryCapillaryCapillaryCapillaryCapillary
Active phase DB-1DB-5BPX-5DB-5CP Sil 8 CB
Column length (m) 30.30.30.30.50.
Carrier gas HeHe HeHe
Substrate
Column diameter (mm) 0.250.250.250.250.32
Phase thickness (μm) 0.250.250.250.250.25
Program 45C => 3C/min => 175C => 15C/min => 300C (10min)40C(1min) => 9C/min => 130C => 2C/min => 230C60C(0.2min) => 3K/min => 186C => 10C/min => 240C (5min)35C => 4C/min => 180C => 10C/min => 250C60C(1min) => 5C/min => 160C => 5C/min => 250C(3min)
I 1469.1475.1477.1478.1477.
ReferenceFaleio, Miguel, et al., 2005Hamm, Bleton, et al., 2005Judzentiene and Mockute, 2005de Menezes, Lemos, et al., 2005Nivinskienë, Butkienë, et al., 2005
Comment MSDC-RI MSDC-RI MSDC-RI MSDC-RI MSDC-RI
Column type CapillaryCapillaryCapillaryCapillaryCapillary
Active phase Polydimethyl siloxane with 5 % Ph groupsCP Sil 8 CBDB-5DB-5DB-5
Column length (m)  50.30.30.30.
Carrier gas  HeHeHeHe
Substrate
Column diameter (mm)  0.320.250.250.25
Phase thickness (μm)  0.250.10.10.1
Program not specified60C(2min) => 5C/min => 160C(1min) => 10C/min => 250C (3min)35C => 4C/min => 180C => 10C/min => 250C35C => 4C/min => 180C => 10C/min => 250C35C => 4C/min => 180C => 20C/min => 280C
I 1479.1480.1456.1464.1477.
ReferencePino, Marbot, et al., 2005Radudienë, Judpintienë, et al., 2005Albuquerque, Silveira, et al., 2004Albuquerque, Souza, et al., 2004Barros-Filho, Nunes, et al., 2004
Comment MSDC-RI MSDC-RI MSDC-RI MSDC-RI MSDC-RI
Column type CapillaryCapillaryCapillaryCapillaryCapillary
Active phase CP Sil 8 CBOV-1DB-5CP Sil 8 CBDB-1
Column length (m) 50.15.30.50.30.
Carrier gas HeHeHeHeHe
Substrate
Column diameter (mm) 0.320.3170.250.320.25
Phase thickness (μm) 0.25 0.250.250.25
Program 50C(5min) => 2C/min => 90C => 15C/min => 240C(4min)50C(4min) => 4C/min => 90C => 10C/min => 300C(10min)40C(1min) => 9C/min => 130C => 2C/min => 230C60C(2min) => 5C/min => 160C(1min) => 10C/min => 250C (5min)45C => 3C/min => 175C => 15C/min => 300C (10min)
I 1480.1467.1475.1477.1469.
ReferenceButkienë, Nivinskienë, et al., 2004El-Shazly and Hussein, 2004Hamm, Bleton, et al., 2004Judpentienë and Mockutë, 2004Miguel, Simões, et al., 2004
Comment MSDC-RI MSDC-RI MSDC-RI MSDC-RI MSDC-RI
Column type CapillaryCapillaryCapillaryCapillaryCapillary
Active phase CP Sil 8 CBCP Sil 8 CBHP-5MSHP-5DB-1
Column length (m) 50.50.30.30.30.
Carrier gas HeHeHe Helium
Substrate
Column diameter (mm) 0.320.320.250.250.25
Phase thickness (μm)  0.250.250.250.25
Program 50 0C (2 min) 3 0C/min -> 180 0C (1 min) 20 0C/min -> 250 0C (2 min)50C(2min) => 3C/min => 180C(1min) => 20C/min => 250C (2min)50C(3min) => 3C/min => 150C(10min) => 10C/min => 250C40C(5min) => 2C/min => 250C(15min) => 10C/min => 270C35 0C 4 0C/min -> 180 0C 10 0C/min -> 250 0C
I 1477.1477.1480.1478.1479.
ReferenceMockutë, Bernotienë, et al., 2004Mockutë, Judbentienë, et al., 2004Sahin, Gulluce, et al., 2004Senatore, Apostolides Arnold, et al., 2004Silva, Matos, et al., 2004
Comment MSDC-RI MSDC-RI MSDC-RI MSDC-RI MSDC-RI
Column type CapillaryCapillaryCapillaryCapillaryCapillary
Active phase HP-5SE-30DB-5CP-Sil 8CB-MSCP Sil 8 CB
Column length (m) 30. 30.50.50.
Carrier gas He He He
Substrate
Column diameter (mm) 0.25 0.250.320.32
Phase thickness (μm) 0.25 0.25 0.25
Program 50C (3min) => 3C/min => 150C (10min) => 10C/min => 250Cnot specified40C (1min) => 9C/min => 130C => 2C/min => 230C60C(1min) => 3C/min => 70C => 15C/min => 170C(8min) => 5C/min => 250C60C(1min) => 5C/min => 160C => 10C/min => 250C(5min)
I 1480.1475.1475.1477.1477.
ReferenceTepe, Donmez, et al., 2004Vinogradov, 2004Hamm, Lesellier, et al., 2003Mockute, Bernotiene, et al., 2003Mockute, Nivinskiene, et al., 2003
Comment MSDC-RI MSDC-RI MSDC-RI MSDC-RI MSDC-RI
Column type CapillaryCapillaryCapillaryCapillaryCapillary
Active phase HP-1DB-5CP Sil 8 CBDB-5OV-101
Column length (m) 25.  30.50.
Carrier gas    HeN2
Substrate
Column diameter (mm) 0.2  0.250.25
Phase thickness (μm) 0.11  0.25
Program 60C (3min) => 2.5C/min => 190C (1min) => 70C/min => 240V (11min)not specifiednot specified35C => 4C/min => 180C => 20C/min => 280Cnot specified
I 1459.1480.1479.1472.1475.
ReferenceKovacevic and Kac, 2002Morteza-Semnani and Vahedi, 2002Schwob, Bessière, et al., 2002Viana, Andrade-Neto, et al., 2002Yang, 2001
Comment MSDC-RI MSDC-RI MSDC-RI MSDC-RI MSDC-RI
Column type CapillaryCapillaryCapillaryCapillaryCapillary
Active phase DB-1SE-30CP Sil 5 CBCP Sil 5 CBCP Sil 5 CB
Column length (m) 30.30.25.25.25.
Carrier gas H2HeliumHe He
Substrate
Column diameter (mm) 0.250.250.390.39
Phase thickness (μm) 0.250.20  0.39
Program 40 0C 3 K/min -> 175 0C 15 K/min -> 240 0C (10 min)not specifiednot specifiednot specifiednot specified
I 1469.1524.1488.1474.1472.
Referenceda Silva, Pedro, et al., 2000Prikhod'ko, Klyuev, et al., 1999Weyerstahl, Marschall, et al., 1999Weyerstahl, Marschall, et al., 1999, 2Weyerstahl, Marschall, et al., 1999, 3
Comment MSDC-RI MSDC-RI MSDC-RI MSDC-RI MSDC-RI
Column type CapillaryCapillaryCapillaryCapillaryCapillary
Active phase DB-1OV-1CP Sil 5 CBCP Sil 5 CBDB-1
Column length (m) 30.50.25.25.30.
Carrier gas HeHeN2N2He
Substrate
Column diameter (mm) 0.250.32  0.25
Phase thickness (μm) 0.250.250.39 0.25
Program 45C => 3C/min => 175C => 15C/min => 240C (10min)1)50C(1min) => 4C/min => 180C => 2C/min => 250C(10min) 2)50C(1min) => 6C/min => 200C => 12C/min => 250C(5min)not specifiednot specified45C => 3C/min => 175C => 15C/min => 280C
I 1469.1471.1473.1474.1469.
ReferenceBaratta, Dorman, et al., 1998Kökdil, 1998Weyerstahl, Marschall, et al., 1998Weyerstahl, Marschall, et al., 1998, 2Gaspar, Palma, et al., 1997
Comment MSDC-RI MSDC-RI MSDC-RI MSDC-RI MSDC-RI
Column type CapillaryCapillaryCapillary
Active phase DB-1Methyl SiliconeOV-101
Column length (m) 30.
Carrier gas Helium
Substrate
Column diameter (mm) 0.25
Phase thickness (μm)
Program 35 0C 4 0C/min -> 180 0C 10 0C/min -> 250 0Cnot specifiednot specified
I 1466.1474.1479.
Referencede Morais, Craveiro, et al., 1996Zenkevich, 1996Menut, Lamaty, et al., 1994
Comment MSDC-RI MSDC-RI MSDC-RI

Van Den Dool and Kratz RI, polar column, temperature ramp

Data compiled by: NIST Mass Spectrometry Data Center, William E. Wallace, director

Column type CapillaryCapillaryCapillaryCapillaryCapillary
Active phase RTX-WaxRTX-WaxBP-20BP-20RTX-Wax
Column length (m) 60.60.50.50.60.
Carrier gas HeHe HeHe
Substrate
Column diameter (mm) 0.220.220.220.220.22
Phase thickness (μm) 0.250.250.250.250.25
Tstart (C) 60.60.60.60.60.
Tend (C) 230.230.220.220.230.
Heat rate (K/min) 2.2.2.2.2.
Initial hold (min)
Final hold (min) 35.35.20.20.45.
I 1681.1681.1688.1666.1684.
ReferencePaolini J., Costa J., et al., 2007Paolini, Muselli, et al., 2007Blanc, Bradesi, et al., 2006Boti, Bighelli, et al., 2006Cavalli, Tomi, et al., 2006
Comment MSDC-RI MSDC-RI MSDC-RI MSDC-RI MSDC-RI
Column type CapillaryCapillaryCapillaryCapillaryCapillary
Active phase HP-WaxBP-20Supelcowax-10PEGBP-20
Column length (m) 30.50.30.30.50.
Carrier gas N2HeHeN2He
Substrate
Column diameter (mm) 0.250.220.20.320.22
Phase thickness (μm) 0.250.250.20.250.25
Tstart (C) 60.60.70.50.60.
Tend (C) 220.220.220.220.220.
Heat rate (K/min) 5.2.3.2.2.
Initial hold (min) 10.  3.
Final hold (min)  20.15.15.20.
I 1681.1678.1683.1715.1683.
ReferenceFlamini, Tebano, et al., 2006Gonny, Cavaleiro, et al., 2006Pinto, Pina-Vaz, et al., 2006Dob, Berramdane, et al., 2005Ferrari, Tomi, et al., 2005
Comment MSDC-RI MSDC-RI MSDC-RI MSDC-RI MSDC-RI
Column type CapillaryCapillaryCapillaryCapillaryCapillary
Active phase RTX-WaxBP-20DB-WaxHP-WaxHP-Innowax
Column length (m) 60.50.30.30.30.
Carrier gas HeHeN2HeHe
Substrate
Column diameter (mm) 0.220.220.250.250.25
Phase thickness (μm) 0.250.250.250.250.5
Tstart (C) 60.60.60.60.60.
Tend (C) 230.230.220.240.260.
Heat rate (K/min) 2.2.5.3.3.
Initial hold (min)   10.
Final hold (min) 35.35.
I 1681.1681.1690.1682.1704.
ReferencePaolini, Costa, et al., 2005Vellutini, Baldovini, et al., 2005Bertoli, Menichini, et al., 2004Flamini, Bader, et al., 2004Grujic-Jovanovic, Skaltsa, et al., 2004
Comment MSDC-RI MSDC-RI MSDC-RI MSDC-RI MSDC-RI
Column type CapillaryCapillaryCapillaryCapillaryCapillary
Active phase BP-20HP-WaxCarbowax 20MRTX-WaxHP-Innowax
Column length (m) 50.30.25.60.30.
Carrier gas HeN2HeHeHe
Substrate
Column diameter (mm) 0.220.250.250.220.25
Phase thickness (μm) 0.250.250.30.250.5
Tstart (C) 60.60.50.60.60.
Tend (C) 220.220.200.230.260.
Heat rate (K/min) 2.5.3.2.3.
Initial hold (min)  10.1.
Final hold (min) 20. 20.45.
I 1672.1702.1675.1677.1695.
ReferenceTam, Thuam, et al., 2004Bader, Caponi, et al., 2003Bicchi, Rubiolo, et al., 2003Cavalli, Tomi, et al., 2003Tzakou, Couladis, et al., 2003
Comment MSDC-RI MSDC-RI MSDC-RI MSDC-RI MSDC-RI
Column type CapillaryCapillaryCapillaryCapillaryCapillary
Active phase InnowaxHP-InnowaxHP-InnowaxAT-WaxBP-20
Column length (m) 30.30.30.60.50.
Carrier gas HeHeHeHeHe
Substrate
Column diameter (mm) 0.250.250.250.320.22
Phase thickness (μm) 0.50.500.500.250.25
Tstart (C) 60.60.60.65.60.
Tend (C) 260.260.260.250.220.
Heat rate (K/min) 3.3.3.2.2.
Initial hold (min)    10.
Final hold (min) 10.10. 60.20.
I 1702.1690.1695.1673.1677.
ReferenceCouladis, Chinou, et al., 2002Couladis, Baziou, et al., 2001Couladis, Tzakou, et al., 2001Pino, Marbot, et al., 2001Rezzi, Bighelli, et al., 2001
Comment MSDC-RI MSDC-RI MSDC-RI MSDC-RI MSDC-RI
Column type CapillaryCapillaryCapillaryCapillaryCapillary
Active phase InnowaxBP-20DB-WaxCarbowax 20MDB-Wax
Column length (m) 60.50.60.50.60.
Carrier gas HeHeHeHeHe
Substrate
Column diameter (mm) 0.250.220.250.20.20
Phase thickness (μm) 0.250.250.250.20.20
Tstart (C) 50.60.50.30.70.
Tend (C) 180.230.180.170.180.
Heat rate (K/min) 2.52.2.54.2.
Initial hold (min) 5. 5.2.5.
Final hold (min)  35. 20.
I 1676.1680.1676.1688.1685.
ReferenceStashenko, Cervantes, et al., 1999Mariotti, Tomi, et al., 1997Stashenko, Prada, et al., 1996Píry, Príbela, et al., 1995Stashenko, Wiame, et al., 1995
Comment MSDC-RI MSDC-RI MSDC-RI MSDC-RI MSDC-RI
Column type CapillaryCapillary
Active phase HP-20MDB-Wax
Column length (m) 50.30.
Carrier gas HeHe
Substrate
Column diameter (mm) 0.250.32
Phase thickness (μm)  0.5
Tstart (C) 60.40.
Tend (C) 190.220.
Heat rate (K/min) 3.3.
Initial hold (min)
Final hold (min)
I 1681.1684.
ReferenceChung, Eiserich, et al., 1993Le Quere and Latrasse, 1990
Comment MSDC-RI MSDC-RI

Normal alkane RI, non-polar column, isothermal

Data compiled by: NIST Mass Spectrometry Data Center, William E. Wallace, director

Column type Capillary
Active phase DB-5
Column length (m)
Carrier gas
Substrate
Column diameter (mm)
Phase thickness (μm)
Temperature (C) 25.
I 1477.
ReferenceHemmateenejad, Jawadnia, et al., 2007
Comment MSDC-RI

Kovats' RI, polar column, custom temperature program

Data compiled by: NIST Mass Spectrometry Data Center, William E. Wallace, director

Column type Capillary
Active phase HP-Innowax
Column length (m) 30.
Carrier gas H2
Substrate
Column diameter (mm) 0.32
Phase thickness (μm) 0.50
Program 60 0C (8 min) 3 K/min -> 180 0C 20 K/min -> 230 0C (20 min)
I 1701.
ReferenceFrizzo, Serafini, et al., 2001
Comment MSDC-RI

Kovats' RI, polar column, isothermal

Data compiled by: NIST Mass Spectrometry Data Center, William E. Wallace, director

Column type Packed
Active phase Carbowax 20M
Column length (m)
Carrier gas
Substrate
Column diameter (mm)
Phase thickness (μm)
Temperature (C) 165.
I 1725.
ReferenceAndersen and Falcone, 1969
Comment MSDC-RI

References

Albano, Lima, et al., 2012
Albano, S.M.; Lima, A.S.; Miguel, M.G.; Pedro, L.G.; Barroso, J.G.; Figueiredo, A.C., Antioxidant, anti-5-lipoxygenase and antiacetylcholinesterase activities of essential oils and decoction water of some aromatic plants, Rec. Nat. Prod., 2012, 6, 1, 35-48. [all data]

Bendiabdellah, El Amine Dib, et al., 2012
Bendiabdellah, A.; El Amine Dib, M.; Djabou, N.; Allali, H.; Tabti, B.; Costa, J.; Myseli, A., Biological activities and volatile cinstituents of Daucus muricatus L. from Algeria, Chem. Centr. J., 2012, 6, 48, 1-22. [all data]

Velickovic, Ristic, et al., 2012
Velickovic, D.T.; Ristic, M.S.; Karabegovic, I.T.; Stojicevic, S.S.; Lazic, M.L., The influence of the distillation method on the chemical composition of the essential oil of sage (Salvia officinalis L.), Advanced Technologies, 2012, 1, 1, 47-51. [all data]

Chaverri, Diaz, et al., 2011
Chaverri, C.; Diaz, C.; Cicco, J.F., Chemical analysis of essential oils from Ocotea gomezii W.C. Burger and Ocotea morae Gomez-Laur. (Lauraceae) collected at Reserva biologica Alberto M. Brenes in Costa Rica and their cytotoxic activity on Tumor cell lines, J. Braz. Chem. Soc., 2011, 22, 4, s1-s4, https://doi.org/10.1590/S0103-50532011000400018 . [all data]

Citron, Riclea, et al., 2011
Citron, C.A.; Riclea, R.; Brock, N.L.; Dickschat, J.S., Biosynthesis of acorane sesquiterpenes by Trichoderma. Electronic supplemental materials (ESI), Royal Soc. Chem., 2011, 1-10. [all data]

Nance and Setzer, 2011
Nance, M.R.; Setzer, W.N., Volatile components of aroma hops (Humulus lupulus L.) commonly used in beer brewing, J. of Brewing and Distilling, 2011, 2, 2, 16-22. [all data]

Al-Reza, Rahman, et al., 2010
Al-Reza, S.M.; Rahman, A.; Lee, J.; Kang, S.C., Potential roles of essential oil and organic extracts of Zizyphus jujuba in inhibiting food-borne pathogens, Food Chem., 2010, 119, 3, 981-986, https://doi.org/10.1016/j.foodchem.2009.07.059 . [all data]

Kahriman, Tosun, et al., 2010
Kahriman, N.; Tosun, G.; Genc, H.; Yayli, N., Comparative essential oil analysis of Geranium sylvaticum estracted by hydrodistillation and microwave distillation, Turk. J. Chem., 2010, 34, 969-976. [all data]

Takeoka, Hobbs, et al., 2010
Takeoka, G.R.; Hobbs, C.; Byeoung-Soo, P., Volatile constituents of the aerial parts of Salvia apiana Jepson, J. Essential Oil. Res., 2010, 22, 3, 241-244, https://doi.org/10.1080/10412905.2010.9700314 . [all data]

Xu, Tang, et al., 2010
Xu, X.; Tang, Z.; Liang, Y., Comparative analysis of plant essential oils by GC-MS coupled with integrated chemometric resolution methods, Anal. Methods, 2010, 2, 4, 359-367, https://doi.org/10.1039/b9ay00213h . [all data]

Courtois, Paine, et al., 2009
Courtois, E.A.; Paine, C.E.; Blandinieres, P.-A.; Stien, D.; Bessiere, J.-M.; Houel, E.; Baraloto, C.; Chave, J., Diversity of the volatile organic compounds emitted by 55 species of tropical trees: a survey in French Guiana, J. Chem. Ecol., 2009, 35, 11, 1349-1362, https://doi.org/10.1007/s10886-009-9718-1 . [all data]

Custer, 2009
Custer, Y., GC Volatile Components Analysis of Different Parts of Litchi chinensis (Dissertation), 2009. [all data]

Delort and Jaquier, 2009
Delort, E.; Jaquier, A., Novel terpenyl esters from Australian finger lime (Citrus australasica) peel extract, Flav. Fragr. J., 2009, 24, 3, 123-132, https://doi.org/10.1002/ffj.1922 . [all data]

Leela, Vipin, et al., 2009
Leela, N.K.; Vipin, T.M.; Shafeekh, K.M.; Priyanka, V.; Rema, J., Chemical composition of essential oils from aerial parts of Cinnamomum malabatrum (Burman f.) Bercht Presl., Flavor Fragr. J., 2009, 24, 1, 13-16, https://doi.org/10.1002/ffj.1910 . [all data]

Mancini, Arnold, et al., 2009
Mancini, E.; Arnold, N.A.; De Martino, L.; De Feo, V.; Formisano, C.; Rigano, D.; Senatore, F., Chemical composition and phytotoxic effects of essential oils of Salvia hierosolymitana Boiss. and Salvia multicaulis Vahl. var. simplicifolia Boiss. growing wild in Lebanon, Molecules, 2009, 14, 11, 4725-4736, https://doi.org/10.3390/molecules14114725 . [all data]

Mendes, Trindade, et al., 2009
Mendes, M.D.; Trindade, H.; Figueiredo, A.C.; Pedro, L.G.; Barroso, J.G., Chaerophyllum azoricun Trel. grown in the Azores archipelago, Portugal: evaluation of the genetic diversity using molecular markers and comparison with volatile oils profiles, Flavour Fragr. J., 2009, 24, 5, 259-265, https://doi.org/10.1002/ffj.1939 . [all data]

Mendes, Trindade, et al., 2009, 2
Mendes, M.D.; Trindade, H.; Figueiredo, A.C.; Barroso, J.G.; Fontinha, S.S.; Pedro, L.G., Volatile and molecular characterization of two Portuguese endemic species: Angelica lignescens and Melanoselinium decipiens, Biochen. Systematics Ecol., 2009, 37, 2, 98-105, https://doi.org/10.1016/j.bse.2008.12.006 . [all data]

Porto, Decorti, et al., 2009
Porto, C.Da.; Decorti, D.; Kikic, I., Flavour compounds of Lavandula angustifolia L. to use in food manufacturing: comparison of three different extraction methods, Food Chem., 2009, 112, 4, 1072-1078, https://doi.org/10.1016/j.foodchem.2008.07.015 . [all data]

Su, Wang, et al., 2009
Su, Y.; Wang, C.; Yinlong, G., Analysis of volatile compounds from Mentha hapioealyx Briq. by GC-MS based on accurate mass measurements and retention indices, Acta Chem. Sinica, 2009, 67, 6, 546-554. [all data]

de Albuquerque, Alves, et al., 2008
de Albuquerque, I.L.; Alves, L.A.; Lemos, T.L.G.; Dorneles, C.A.; de Morais, M.O., Constituents of the essential oil of Brazilian grenn propolis from Brazil, J. Essent. Oil Res., 2008, 20, 1-2. [all data]

Gazim, Rezende, et al., 2008
Gazim, Z.C.; Rezende, C.M.; Fraga, S.R.; Filho, B.P.D.; Cortez, D.A.G., Analysis of the essential oils from Calendula officinalis growing in Brazil using three different exteraction procedures, Brazilian J. Pharmaceutical Sci., 2008, 44, 3, 391-395. [all data]

Kilani, Ledauphin, et al., 2008
Kilani, S.; Ledauphin, J.; Bouhlel, I.; Ben Sghaier, M.; Boubaker, J.; Skandrani, I.; Mosrati, R.; Ghedira, K.; Barillier, D.; Chekir-Ghedira, L., Comparative study of Cyperus rotundus essential oil by a modified GC/MS analysis method. Evaluation of its antioxidantt, cytotoxic, and apoptoic effects, Chem. Biodiversity, 2008, 5, 5, 729-742, https://doi.org/10.1002/cbdv.200890069 . [all data]

Kristiawan, Sobolik, et al., 2008
Kristiawan, M.; Sobolik, V.; Al-Haddad, M.; Allaf, K., Effect of pressure-drop rate on the isolation of cananga oil using instantaneous controlled pressure-drop process, Chem. Eng. Processing, 2008, 47, 1, 66-75, https://doi.org/10.1016/j.cep.2007.08.011 . [all data]

Kupcinskiene, Stikliene, et al., 2008
Kupcinskiene, E.; Stikliene, A.; Judzentiene, A., The essential oil guatitative composition in the needles of Pinus sylvestris L. growing along industrial transects, Environ. Pollution, 2008, 155, 3, 481-491, https://doi.org/10.1016/j.envpol.2008.02.001 . [all data]

Lo Presti, Sciarrone, et al., 2008
Lo Presti, M.; Sciarrone, D.; Crupi, M.C.; Costa, R.; Ragusa, S.; Dugo, G.; Mondello, L., Evaliation of the volatile and chiral composition in Pistacia lentiscus L. essential oil, Flavour Fragr. J., 2008, 23, 4, 249-257, https://doi.org/10.1002/ffj.1878 . [all data]

Ning, Zheng, et al., 2008
Ning, H.; Zheng, F.; Sun, B.; Xie, J.; Liu, Y., Solvent-free microwave extraction of essential oil from Zanthoxylum bungeanum Maxim., Food Environ. Ind. (Chinese), 2008, 34, 5, 179-184. [all data]

Nogueira, Marcelo-Curto, et al., 2008
Nogueira, T.; Marcelo-Curto, M.J.; Cristina Figueiredo, A.; Barroso, J.G.; Pedro, L.G.; Rubiolo, P.; Bicchi, C., Chemotaxonomy of Hypericum genus from Portugal: Geographical distribution and essential oils composition of Hypericum perfoliatum, Hypericum humifusum, Hypericum linarifolium and Hypericum pulchrum, Biochem. Syst. Ecol., 2008, 36, 1, 40-50, https://doi.org/10.1016/j.bse.2007.07.004 . [all data]

Profitt, Schatz, et al., 2008
Profitt, M.; Schatz, B.; Bessiere, J.-M.; Chen, C.; Soler, C.; Hossaert-McKey, M., Signalling receptivity: comparison of the emission of volatile compounds by figs of Ficus hispida before, during and after the phase of receptivity to pollinators, Symbiosis, 2008, 45, 1-10. [all data]

Raj, Baby, et al., 2008
Raj, G.; Baby, S.; Dan, M.; Thaha, A.R.M.; Sethuraman, M.G.; George, V., Volatile constituents from the rhisomes of Curcuma haritha Mangaly and Sabu from Sauthern India, Flavour Fragr. J., 2008, 23, 5, 348-352, https://doi.org/10.1002/ffj.1891 . [all data]

Silva, Doria, et al., 2008
Silva, W.L.; Doria, G.A.A.; Maia, R.T.; Nunes, R.S.; Carvalho, G.A.; Blank, A.F.; Alves, P.B.; Marcal, R.M.; Cavalcanti, S.C.H., Effects of essential oils on Aedes aegypti larvae: alternatives to environmentally safe insecticides, Bioresource Technol., 2008, 99, 8, 3251-3255, https://doi.org/10.1016/j.biortech.2007.05.064 . [all data]

Zachariah, Leela, et al., 2008
Zachariah, T.J.; Leela, N.K.; Maya, K.M.; Rema, J.; Mathew, P.A.; Vipin, T.M.; Krishnamoorthy, B., Chemical composition of leaf oils of Myristica beddomeii (King), Myristica fragrans (Houtt.) and Myristica malabarica (Lamk.), J. Spices Arom. Crops, 2008, 17, 1, 10-15. [all data]

Agabriel, Cornu, et al., 2007
Agabriel, C.; Cornu, A.; Journal, C.; Sibra, C.; Groller, C.; MArtin, B., Tanker milk variability according to farm feeding practices: vitamins A and E, carotenoids, color, and terpenoids, J. Dairy Sci., 2007, 90, 10, 4884-4896, https://doi.org/10.3168/jds.2007-0171 . [all data]

Cole, Haber, et al., 2007
Cole, R.A.; Haber, W.A.; Setzer, W.N., Chemical composition of essential oils of seven species of Eugenia from Monteverde, Costa Rica, Biochem. Syst. Ecol., 2007, 35, 12, 877-886, https://doi.org/10.1016/j.bse.2007.06.013 . [all data]

Eason and Setzer, 2007
Eason, H.M.; Setzer, W.N., BArk essential oil composition of Cedrela tinduzii C. DC. (Meliaceae) from Monteverde, Costa Rica, Rec. NAt. Prod., 2007, 1, 2-3, 24-27. [all data]

Formisano, Mignola, et al., 2007
Formisano, C.; Mignola, E.; Rigano, D.; Senatore, F.; Bellone, G.; Bruno, M.; Rosselli, S., Chemical composition and antimicrobial activity of the essential oil from aerial parts of Micromeria fruticulosa (Bertol.) Grande (Lamiaceae) growing wild in Southern Italy, Flavour Fragr. J., 2007, 22, 4, 289-292, https://doi.org/10.1002/ffj.1795 . [all data]

Meekijjaroenroj, Bessière, et al., 2007
Meekijjaroenroj, A.; Bessière, J.-M.; Anstett, M.-C., Chemistry of floral scents in four Licuala species (Arecaceae), Flavour Fragr. J., 2007, 22, 4, 300-310, https://doi.org/10.1002/ffj.1797 . [all data]

Mockute, Bernotiene, et al., 2007
Mockute, D.; Bernotiene, G.; Judzentiene, A., The essential oil of Ground Ivy (Glechoma hederaceae L.) growing wild in Eastern Lithuania, J. Essent. Oil Res., 2007, 19, 5, 449-451, https://doi.org/10.1080/10412905.2007.9699948 . [all data]

Moriarity, Bansal, et al., 2007
Moriarity, D.M.; Bansal, A.; Cole, R.A.; Takaku, S.; Haber, W.A.; Setzer, W.N., Selective cytotoxic activities of leaf essential oils from Monteverde Costa Rica, Natural Product Communications, 2007, 2, 12, 1263-1268. [all data]

Nivinsliene, Butkiene, et al., 2007
Nivinsliene, O.; Butkiene, R.; Gudalevic, A.; Mockute, D.; Meskauskiene, V.; Grigaliunaite, B., Influence of urban environment on chemical composition of Tilia cordata essential oil, Chemija, 2007, 18, 1, 44-49. [all data]

Parker, Pollnitz, et al., 2007
Parker, M.; Pollnitz, A.P.; Cozzolino, D.; Leigh Francis, I.; Herderich, M.J., Identification and Quantification of a Marker Compound for 'Pepper' Aroma and Flavor in Shiraz Grape Berries by Combination of Chemometrics and Gas Chromatography-Mass Spectrometry, J. Agric. Food Chem., 2007, 55, 15, 5948-5955, https://doi.org/10.1021/jf0705320 . [all data]

Pontes, de Olivera, et al., 2007
Pontes, W.J.T.; de Olivera, J.C.G.; da Camara, C.A.G.; Lopes, A.C.H.R.; Gondim Jr.; de Olivera, J.V.; Barros, R.; Schwartz, M.O.E., Chemical composition and acaridical activity of the leaf and fruit essential oils of Protium heptaphyllum (Aubl.) Marchand (Burseraceae), Acta Amazonica, 2007, 37, 1, 103-110, https://doi.org/10.1590/S0044-59672007000100012 . [all data]

Proffit, 2007
Proffit, M., Mediation chimique et structuration des communautes d'hymenopteres parasites du mutualisme figuier / pollinisateur (These pour obtenir le grade de Docteur de l'Universite Montpellier II) (Dissertation), 2007. [all data]

Radusiene, Judzentiene, et al., 2007
Radusiene, J.; Judzentiene, A.; Peciulyte, D.; Janulis, V., Essential Oil Composition and Antimicrobial Assay of Acorus calamus Leaves from Different Wild Populations, Plant Genetic Resources: Characterization and Utilization, 2007, 5, 1, 37-44, https://doi.org/10.1017/S1479262107390928 . [all data]

Ristic, Krivokuca-Dokic, et al., 2007
Ristic, M.; Krivokuca-Dokic, D.; Radanovic, D.; Nastovski, T., Etarsko ulje Arnica montata i Arnica chamissonis, Hem. Ind., 2007, 61, 5, 272-277, https://doi.org/10.2298/HEMIND0704272R . [all data]

Serrano, Cornu, et al., 2007
Serrano, E.; Cornu, A.; Kondjoyan, N.; Figueredo, G.; Agabriel, J.; Micol, D., Terpene accumulation in muscle and fatty tissues of calves supplement with essential oils, J. Animal Feed Sci., 2007, 16, 168-179. [all data]

Setzer, Stokes, et al., 2007
Setzer, W.N.; Stokes, S.L.; Penton, A.F.; Takaku, S.; Haber, W.A.; Hansell, E.; Caffrey, C.R.; McKerrow, J.H., Cruzain inhibitory activity of leaf essential oils of neotropical Lauraceae and essential oil components, Natural Product Communications, 2007, 2, 12, 1203-1210. [all data]

Deng, Xu, et al., 2006
Deng, C.; Xu, X.; Yao, N.; Li, N.; Zhang, X., Rapid determination of essential oil compounds in Artemisia Selengensis Turcz by gas chromatography-mass spectrometry with microwave distillation and simultaneous solid-phase microextraction, Anal. Chim. Acta., 2006, 556, 2, 289-294, https://doi.org/10.1016/j.aca.2005.09.038 . [all data]

Formisano C., Senatore F., et al., 2006
Formisano C.; Senatore F.; Bruno M.; Bellone G., Chemical composition and antimicrobial activity of the essential oil of Phlomis ferruginea Ten. (Lamiaceae) growing wild in Southern Italy, Flavour Fragr. J., 2006, 21, 5, 848-851, https://doi.org/10.1002/ffj.1740 . [all data]

Judzentiene and Buzelyte, 2006
Judzentiene, A.; Buzelyte, J., Chemical composition of essential oils of Artemisia vulgaris L. (mugwort) from North Lithuania, Chemija, 2006, 17, 1, 12-15. [all data]

de Lima, Maia, et al., 2006
de Lima, M.G.A.; Maia, I.C.C.; de Sousa, M.D.; de Morais, S.M.; Freitas, S.M., Effect of stalk and leaf extracts from euphorbiaceae species on Aedes aegypti (Diptera, culicidae) larvae, Rev. Inst. Med. trop. S. Paulo, 2006, 48, 4, 211-214, https://doi.org/10.1590/S0036-46652006000400007 . [all data]

Schmidt, Noletto, et al., 2006
Schmidt, J.M.; Noletto, J.A.; Vogler, B.; Setzer, W.N., Abaco Bush Medicine: Chemical composition of the essential oils of four aromatic medicinal plants from Abaco Island, Bahamas, J. Herbs, Spices Medicinal Plants, 2006, 12, 3, 43-65, https://doi.org/10.1300/J044v12n03_04 . [all data]

Senatore, Apostolides Arnold, et al., 2006
Senatore, F.; Apostolides Arnold, N.; Piozzi, F.; Formisano, C., Chemical composition of the essential oil of Salvia microstegia Boiss. et Balansa growing wild in Lebanon, J. Chromatogr. A, 2006, 1108, 2, 276-278, https://doi.org/10.1016/j.chroma.2006.01.066 . [all data]

Srivastava, Mallavarapu, et al., 2006
Srivastava, S.; Mallavarapu, G.R.; Rai, S.K.; Singh, D.; Mishra, R.; Pandey-Rai, S.; Kumar, S., Composition of the essential oils of the leaves and flowers of Rhus mysurensis Heyne ex Wight Arn growing in the Aravalli mountain range at New Delhi, Flavour Fragr. J., 2006, 21, 2, 228-229, https://doi.org/10.1002/ffj.1561 . [all data]

Tognolini, Barocelli, et al., 2006
Tognolini, M.; Barocelli, E.; Ballabeni, V.; Bruni, R.; Bianchi, A.; Chiavarini, M.; Impicciatore, M., Comparative screening of plant essential oils: Phenylpropanoid moiety as basic core for antiplatelet activity, Life Sciences, 2006, 78, 13, 1419-1432, https://doi.org/10.1016/j.lfs.2005.07.020 . [all data]

Butkienë, Nivinskienë, et al., 2005
Butkienë, R.; Nivinskienë, O.; Mockutë, D., α-Pinene chemotype of leaf (needle) essential oils of Juniperus communis L. growing wild in Vilnius district, Chemija, 2005, 16, 1, 53-60. [all data]

Cysne, Canuto, et al., 2005
Cysne, J.B.; Canuto, K.M.; Pessoa, O.D.L.; Nunes, E.P.; Silveira, E.R., Leaf essential oils of four Piper species from the State of Ceará - Northeast of Brazil, J. Braz. Chem. Soc., 2005, 16, 6B, 1378-1381, https://doi.org/10.1590/S0103-50532005000800012 . [all data]

Faleio, Miguel, et al., 2005
Faleio, L.; Miguel, G.; Gomes, S.; Costa, L.; Venancio, F.; Teixeira, A.; Figueiredo, A.C.; Barroso, J.G.; Pedro, L.G., Antibacterial and Antioxidant Activities of Essential Oils Isolated from Thymbra capitata L. (Cav.) and Origanum vulgare L., J. Agric. Food Chem., 2005, 53, 21, 8162-8168, https://doi.org/10.1021/jf0510079 . [all data]

Hamm, Bleton, et al., 2005
Hamm, S.; Bleton, J.; Connan, J.; Tchapla, A., A chemical investigation by headspace SPME and GC-MS of volatile and semi-volatile terpenes in various olibanum samples, Phytochemistry, 2005, 66, 12, 1499-1514, https://doi.org/10.1016/j.phytochem.2005.04.025 . [all data]

Judzentiene and Mockute, 2005
Judzentiene, A.; Mockute, D., The inflorescence and leaf essential oils of Tanacetum vulgare L. var. vulgare growing wild in Lithuania, Biochem. Syst. Ecol., 2005, 33, 5, 487-498, https://doi.org/10.1016/j.bse.2004.11.003 . [all data]

de Menezes, Lemos, et al., 2005
de Menezes, J.E.S.A.; Lemos, T.L.G.; Silveira, E.R.; Andrade-Neto, M.; Nascimento, R.F.; Pessoa, O.D.L., Volatile constituents of Cordia trichotoma Vell. from the northeast of Brazil, Flavour Fragr. J., 2005, 20, 2, 149-151, https://doi.org/10.1002/ffj.1394 . [all data]

Nivinskienë, Butkienë, et al., 2005
Nivinskienë, O.; Butkienë, R.; Mockutë, D., Chemical composition of seed (fruit) essential oils of Angelica archangelica L. growing wild in Lithuania, Chemija, 2005, 16, 3-4, 51-54. [all data]

Pino, Marbot, et al., 2005
Pino, J.A.; Marbot, R.; Rosado, A.; Vázquez, C., Volatile constituents of Malay rose apple [Syzygium malaccense (L.) Merr. Perry], Flavour Fragr. J., 2005, 20, 98-100. [all data]

Radudienë, Judpintienë, et al., 2005
Radudienë, J.; Judpintienë, A.; Peèiulytë, D.; Janulis, V., Chemical composition of essential oil and antimicrobial activity of Origanum vulgare, Biologija, 2005, 4, 53-58. [all data]

Albuquerque, Silveira, et al., 2004
Albuquerque, M.R.J.R.; Silveira, E.R.; Uchôa, D.E.A.; Lemos, T.L.G.; Souza, E.B.; Santiago, G.M.P.; Pessoa, O.D.L., Chemical composition and larvicidal activity of the essential oils from Eupatorium betonicaeforme (D.C.) Baker (Asteraceae), J. Agric. Food Chem., 2004, 52, 22, 6708-6711, https://doi.org/10.1021/jf0352881 . [all data]

Albuquerque, Souza, et al., 2004
Albuquerque, M.R.J.R.; Souza, E.B.; Lins, M.U.D.S.; Nogueira, N.A.P.; Lemos, T.L.G.; Silveira, E.R.; Pessoa, O.D.L., Composition and antimicrobial activity of the essential oil from aerial parts of Baccharis trinervis (Lam.) Pers., Arkivoc, 2004, 6, 6, 59-65, https://doi.org/10.3998/ark.5550190.0005.608 . [all data]

Barros-Filho, Nunes, et al., 2004
Barros-Filho, B.A.; Nunes, F.M.; de Oliveira, M.C.F.; Mafezoli, J.; Andrade-Neto, M.; Silveira, E.R.; Pirani, J.R., Volatile constituents from Esenbeckia almawillia (Rutaceae), Biochem. Syst. Ecol., 2004, 32, 9, 817-821, https://doi.org/10.1016/j.bse.2004.02.003 . [all data]

Butkienë, Nivinskienë, et al., 2004
Butkienë, R.; Nivinskienë, O.; Mockutë, D., Chemical composition of unripe and ripe berry essential oils of Juniperus communis L. growing wild in Vilnius district, Chemija, 2004, 15, 4, 57-63. [all data]

El-Shazly and Hussein, 2004
El-Shazly, A.M.; Hussein, K.T., Chemical analysis and biological activities of the essential oil of Teucrium leucocladum Boiss. (Lamiaceae), Biochem. Syst. Ecol., 2004, 32, 7, 665-674, https://doi.org/10.1016/j.bse.2003.12.009 . [all data]

Hamm, Bleton, et al., 2004
Hamm, S.; Bleton, J.; Tchapla, A., Headspace solid phase microextraction for screening for the presence of resins in Egyptian archaeological samples, J. Sep. Sci., 2004, 27, 3, 235-243, https://doi.org/10.1002/jssc.200301611 . [all data]

Judpentienë and Mockutë, 2004
Judpentienë, A.; Mockutë, D., Chemical composition of essential oils of Artemisia absinthium L. (wormwood) growing wild in Vilnius, Chemija, 2004, 15, 4, 64-68. [all data]

Miguel, Simões, et al., 2004
Miguel, G.; Simões, M.; Figueiredo, A.C.; Barroso, J.G.; Pedro, L.G.; Carvalho, L., Composition and antioxidant activities of the essential oils of Thymus caespititius, Thymus camphoratus and Thymus mastichina, Food Chem., 2004, 86, 2, 183-188, https://doi.org/10.1016/j.foodchem.2003.08.031 . [all data]

Mockutë, Bernotienë, et al., 2004
Mockutë, D.; Bernotienë, G.; Judbentienë, A., Chemical composition of essential oils of Origanum vulgare L. growing in Lithuania, Biologija, 2004, 4, 44-49. [all data]

Mockutë, Judbentienë, et al., 2004
Mockutë, D.; Judbentienë, A.; Bernotienë, G., Volatile constituents of cultivated Origanum vulgare L. inflorescences and leaves, Chemija, 2004, 15, 1, 33-37. [all data]

Sahin, Gulluce, et al., 2004
Sahin, F.; Gulluce, M.; Daferera, D.; Sokmen, A.; Sokmen, M.; Polissiou, M.; Agar, G.; Ozer, H., Biological activities of the essential oils and methanol extract of Origanum vulgare ssp. vulgare in the Eastern Anatolia region of Turkey, Food Control, 2004, 15, 7, 549-557, https://doi.org/10.1016/j.foodcont.2003.08.009 . [all data]

Senatore, Apostolides Arnold, et al., 2004
Senatore, F.; Apostolides Arnold, N.; Piozzi, F., Chemical composition of the essential oil of Salvia multicaulis Vahl. var. simplicifolia Boiss. growing wild in Lebanon, J. Chromatogr. A, 2004, 1052, 1-2, 237-240, https://doi.org/10.1016/j.chroma.2004.08.095 . [all data]

Silva, Matos, et al., 2004
Silva, M.G. deV.; Matos, F.J. de.A.; Lopes, P.R.O.; Silva, F.O.; Holanda, M.T., Composition of Essential Oils from Three Ocimum Species Obtained by Steam and Microwave Distillation and Supercritical CO2 Extraction, ARKIVOS, 2004, 6, 6, 66-71, https://doi.org/10.3998/ark.5550190.0005.609 . [all data]

Tepe, Donmez, et al., 2004
Tepe, B.; Donmez, E.; Unlu, M.; Candan, F.; Daferera, D.; Vardar-Unlu, G.; Polissiou, M.; Sokmen, A., Antimicrobial and antioxidative activities of the essential oils and methanol extracts of Salvia cryptantha (Montbret et Aucher ex Benth.) and Salvia multicaulis (Vahl), Food Chem., 2004, 84, 4, 519-525, https://doi.org/10.1016/S0308-8146(03)00267-X . [all data]

Vinogradov, 2004
Vinogradov, B.A., Production, composition, properties and application of essential oils, 2004, retrieved from http://viness.narod.ru. [all data]

Hamm, Lesellier, et al., 2003
Hamm, S.; Lesellier, E.; Bleton, J.; Tchapla, A., Optimization of headspace solid phase microextraction for gas chromatography/mass spectrometry analysis of widely different volatility and polarity terpenoids in olibanum, J. Chromatogr. A, 2003, 1018, 1, 73-83, https://doi.org/10.1016/j.chroma.2003.08.027 . [all data]

Mockute, Bernotiene, et al., 2003
Mockute, D.; Bernotiene, G.; Judzentiene, A., Volatile compounds of the aerial parts of wild St. John's wort (Hypericum perforatum L.) plants, Chemija, 2003, 14, 3, 108-111. [all data]

Mockute, Nivinskiene, et al., 2003
Mockute, D.; Nivinskiene, O.; Bernotiene, G.; Butkiene, R., The cis-thujone chemotype of Salvia officinalis L. essential oils, Chemija, 2003, 14, 4, 216-220. [all data]

Kovacevic and Kac, 2002
Kovacevic, N.; Kac, M., Analytical, nutritional, and clinical methods section. Determination and verification of hop varieties by analysis of essential oils, Food Chem., 2002, 77, 4, 489-494, https://doi.org/10.1016/S0308-8146(02)00114-0 . [all data]

Morteza-Semnani and Vahedi, 2002
Morteza-Semnani, K.; Vahedi, M., Volatile constituents of Iranian Hypericum perforatum L., Proceedings of ICNP-2002 - Trabzon/Turkiye, 2002, 342-344. [all data]

Schwob, Bessière, et al., 2002
Schwob, I.; Bessière, J.-M.; Dherbomez, M.; Viano, J., Composition and antimicrobial activity of the essential oil of Hypericum coris, Fitoterapia, 2002, 73, 6, 511-513, https://doi.org/10.1016/S0367-326X(02)00171-5 . [all data]

Viana, Andrade-Neto, et al., 2002
Viana, F.A.; Andrade-Neto, M.; Pouliquen, Y.B.M.; Uchoa, D.E.A.; Sobral, M.M.S.Z.; de Morais, S.M., Essential oil of Siparuna guianensis aublet from the Amazon region of Brazil, J. Essent. Oil Res., 2002, 14, 1, 60-62, https://doi.org/10.1080/10412905.2002.9699765 . [all data]

Yang, 2001
Yang, R., Analysis of the volatile components in peel oil of Yuzu by gas chromatography/mass spectrometry, Chin. J. Anal. Chem., 2001, 29, 3, 313-316. [all data]

da Silva, Pedro, et al., 2000
da Silva, J.A.; Pedro, L.G.; Santos, P.A.G.; Figueiredo, A.C.; Barroso, J.G.; Tenreiro, R.P.; Ribeiro, C.A.; Deans, S.G.; Looman, A.; Scheffer, J.J.C., Essential oils from seven populations of Juniperus brevifolia (Seub.) Antoine, an endemic species of the Azores, Flavour Fragr. J., 2000, 15, 1, 31-39, https://doi.org/10.1002/(SICI)1099-1026(200001/02)15:1<31::AID-FFJ862>3.0.CO;2-C . [all data]

Prikhod'ko, Klyuev, et al., 1999
Prikhod'ko, A.B.; Klyuev, N.A.; Volkovich, S.V.; Emets, T.I.; Petrenko, V.V.; Dolya, E.V., Component composition od the essential oil of Thymus dimorphus, Chem. Nat. Comp., 1999, 35, 1, 46-51, https://doi.org/10.1007/BF02238208 . [all data]

Weyerstahl, Marschall, et al., 1999
Weyerstahl, P.; Marschall, H.; Son, P.T.; Giang, P.M., Constituents of the flower essential oil of Aglaia odorata Lour. from Vietnam, Flavour Fragr. J., 1999, 14, 4, 219-224, https://doi.org/10.1002/(SICI)1099-1026(199907/08)14:4<219::AID-FFJ815>3.0.CO;2-# . [all data]

Weyerstahl, Marschall, et al., 1999, 2
Weyerstahl, P.; Marschall, H.; Splittgerber, U.; Son, P.T.; Giang, P.M.; Kaul, V.K., Constituents of the essential oil from the fruits of Zanthoxylum rhetsoides Drake from Vietnam and from the aerial parts of Zanthoxylum alatum Roxb. from India, Flavour Fragr. J., 1999, 14, 4, 225-229, https://doi.org/10.1002/(SICI)1099-1026(199907/08)14:4<225::AID-FFJ818>3.0.CO;2-1 . [all data]

Weyerstahl, Marschall, et al., 1999, 3
Weyerstahl, P.; Marschall, H.; Son, P.T.; Giang, P.M., Constituents of Vietnamese pemou oil - a reinvestigation, Flavour Fragr. J., 1999, 14, 6, 409-410, https://doi.org/10.1002/(SICI)1099-1026(199911/12)14:6<409::AID-FFJ843>3.0.CO;2-B . [all data]

Baratta, Dorman, et al., 1998
Baratta, M.T.; Dorman, H.J.; Deans, S.G.; Figueiredo, A.C.; Barroso, J.G.; Ruberto, G., Antimicrobial and antioxidant properties of some commercial essential oils, Flavour Fragr. J., 1998, 13, 4, 235-244, https://doi.org/10.1002/(SICI)1099-1026(1998070)13:4<235::AID-FFJ733>3.0.CO;2-T . [all data]

Kökdil, 1998
Kökdil, G., Composition of the essential oil of Clinopodium vulgare L. ssp. arundanum (Boiss.) Nyman collected from two different localities in Turkey, Flavour Fragr. J., 1998, 13, 3, 170-172, https://doi.org/10.1002/(SICI)1099-1026(199805/06)13:3<170::AID-FFJ721>3.0.CO;2-H . [all data]

Weyerstahl, Marschall, et al., 1998
Weyerstahl, P.; Marschall, H.; Thefeld, K.; Subba, G.C., Constituents of the essential oil from the rhizomes of Hedychium gardnerianum Roscoe, Flavour Fragr. J., 1998, 13, 6, 377-388, https://doi.org/10.1002/(SICI)1099-1026(199811/12)13:6<377::AID-FFJ755>3.0.CO;2-F . [all data]

Weyerstahl, Marschall, et al., 1998, 2
Weyerstahl, P.; Marschall, H.; Wolf, D., Constituents of commercial Brazilian cabore oil, Flavour Fragr. J., 1998, 13, 2, 85-86, https://doi.org/10.1002/(SICI)1099-1026(199803/04)13:2<85::AID-FFJ697>3.0.CO;2-9 . [all data]

Gaspar, Palma, et al., 1997
Gaspar, H.; Palma, F.M.S.B.; de la Torre, M.C.; Rodríguez, B.; Barroso, J.G.; Figueiredo, A.C., Composition of the essential oil of Teucrium haenseleri Boiss., Flavour Fragr. J., 1997, 12, 5, 355-357, https://doi.org/10.1002/(SICI)1099-1026(199709/10)12:5<355::AID-FFJ656>3.0.CO;2-B . [all data]

de Morais, Craveiro, et al., 1996
de Morais, S.M.; Craveiro, A.A.; Machado, M.I.L.M.; Alencar, J.W.; Matos, J.A., Volatile constituents of Eugenia unifluora leaf oil from Notheastern Brazil, J. Ess. Oil Res., 1996, 8, 4, 449-451, https://doi.org/10.1080/10412905.1996.9700664 . [all data]

Zenkevich, 1996
Zenkevich, I.G., Analytical Parameters of Components of Essential Oils for their Chromatographic and Chromato-Mass Spectral Identification. Mono- and Sesquiterpenes, Rastitelnye Resursy (Plant resources), 1996, 34, 1-2, 48-58. [all data]

Menut, Lamaty, et al., 1994
Menut, C.; Lamaty, G.; Bessiere, J.M.; Ayedoun, M.A.; Setondji, J.; Samate, D.; Nacro, M., Aromatic Plants from Tropical West Africa. II. Volatile Constituents of Daniella oliveri (Rolfe) Hutch Dalz. from Benin and Burkina Faso, J. Essent. Oil Res., 1994, 6, 6, 647-649, https://doi.org/10.1080/10412905.1994.9699362 . [all data]