2-Octanethiol
- Formula: C8H18S
- Molecular weight: 146.294
- IUPAC Standard InChIKey: BZXFEMZFRLXGCY-UHFFFAOYSA-N
- CAS Registry Number: 3001-66-9
- Chemical structure:
View 3d structure (requires JavaScript / HTML 5) - Other names: 2-Octylthiol; octane-2-thiol

Phase change data

Data compiled as indicated in comments:
TRC - Thermodynamics Research Center, NIST Boulder Laboratories, Chris Muzny director
AC - William E. Acree, Jr., James S. Chickos
Quantity | Value | Units | Method | Reference | Comment |
---|---|---|---|---|---|
Tfus | 194.2 | K | N/A | Ellis and Reid, 1932 | Uncertainty assigned by TRC = 0.3 K; TRC |
Enthalpy of vaporization
ΔvapH (kJ/mol) | Temperature (K) | Reference | Comment |
---|---|---|---|
49.0 | 362. | Dykyj, Svoboda, et al., 1999 | Based on data from 347. to 489. K.; AC |

Kovats' RI, non-polar column, isothermal

View large format table.

Column type Active phase Temperature (C) I Reference Comment
PackedApiezon M130.1082.Garbuzov, Misharina, et al., 1985He or N2, Chromosorb W, AW-DMCS; Column length: 2.1 m

Kovats' RI, non-polar column, custom temperature program

View large format table.

Column type Active phase I Reference Comment
CapillaryApiezon M1082.Zhu, Wang, et al., 2007Program: not specified

Kovats' RI, polar column, custom temperature program

View large format table.

Column type Active phase I Reference Comment
CapillaryPEG-20M1298.Zhu, Wang, et al., 2007Program: not specified

References

Ellis and Reid, 1932
Ellis, L.M.; Reid, E.E.,
The Preparation and Properties of A Double Series of Aliphatic Mercaptans,
J. Am. Chem. Soc., 1932, 54, 1674. [all data]
Dykyj, Svoboda, et al., 1999
Dykyj, J.; Svoboda, J.; Wilhoit, R.C.; Frenkel, M.L.; Hall, K.R.,
Vapor Pressure of Chemicals: Part A. Vapor Pressure and Antoine Constants for Hydrocarbons and Sulfur, Selenium, Tellurium and Hydrogen Containing Organic Compounds, Springer, Berlin, 1999, 373. [all data]