Ronnel
- Formula: C8H8Cl3O3PS
- Molecular weight: 321.545
- IUPAC Standard InChIKey: JHJOOSLFWRRSGU-UHFFFAOYSA-N
- CAS Registry Number: 299-84-3
- Chemical structure:
View 3d structure (requires JavaScript / HTML 5) - Other names: Phosphorothioic acid, O,O-dimethyl O-(2,4,5-trichlorophenyl) ester; Blitex; Dermafos; Dow ET 14; Dow ET 57; Ectoral; Etrolene; ENT 23,284; ET 14; ET 57; Fenchlorfos; Fenchlorphos; Fenclofos; Gesektin K; Korlan; Korlane; Moorman's Medicated Rid-Ezy; Nanchor; Nanker; Nankor; O,O-Dimethyl O-(2,4,5-trichlorophenyl) phosphorothioate; O,O-Dimethyl O-(2,4,5-trichlorophenyl) thiophosphate; OMS 123; Phenchlorfos; Remelt; Rovan; Trolen; Trolene; Viozene; Dimethyl (2,4,5-trichlorophenyl) phosphorothionate; Fenchloorfos; O-(2,4,5-Trichloor-fenyl)-O,O-dimethyl-monothiofosfaat; O-(2,4,5-Trichlor-phenyl)-O,O-dimethyl-monothiophosphat; O-(2,4,5-Tricloro-fenil)-O,O-dimetil-monotiofosfato; Phenol, 2,4,5-trichloro-, O-ester with O,O-dimethyl phosphorothioate; Thiophosphate de O,O-dimethyle et de o-(2,4,5-trichlorophenyle); Trichlorometafos; Trolene 20L; Dermafosu; Dermaphos; Dimethyl trichlorophenyl thiophosphate; O,O-Dimethyl-O-(2,4,5-trichlorphenyl)-thionophosphat; Fenchlorfosu; Dimethyl O-(2,4,5-trichlorophenyl) thiophosphate; Trichlormetaphos; Fenchlorophos; Trichlorometaphos; O,O-Dimethyl O-(2,4,5-trichlorophenyl) phosphorothionate

Phase change data

Data compiled as indicated in comments:
TRC - Thermodynamics Research Center, NIST Boulder Laboratories, Chris Muzny director
AC - William E. Acree, Jr., James S. Chickos
Quantity | Value | Units | Method | Reference | Comment |
---|---|---|---|---|---|
Tfus | 314.99 | K | N/A | Donnelly, Drewes, et al., 1990 | Uncertainty assigned by TRC = 0.2 K; TRC |
Tfus | 315.9 | K | N/A | Plato and Glasgow, 1969 | Uncertainty assigned by TRC = 0.1 K; TRC |
Enthalpy of vaporization
ΔvapH (kJ/mol) | Temperature (K) | Method | Reference | Comment |
---|---|---|---|---|
56.8 | 313. | A | Stephenson and Malanowski, 1987 | Based on data from 298. to 373. K.; AC |
Enthalpy of fusion
ΔfusH (kJ/mol) | Temperature (K) | Method | Reference | Comment |
---|---|---|---|---|
18.94 | 313. | DSC | Donnelly, Drewes, et al., 1990, 2 | AC |

Henry's Law data

Data compiled by: Rolf Sander
Henry's Law constant (water solution)
kH(T) = k°H exp(d(ln(kH))/d(1/T) ((1/T) - 1/(298.15 K)))
k°H = Henry's law constant for solubility in water at 298.15 K (mol/(kg*bar))
d(ln(kH))/d(1/T) = Temperature dependence constant (K)
k°H (mol/(kg*bar)) | d(ln(kH))/d(1/T) (K) | Method | Reference |
---|---|---|---|
48. | L | N/A |

Kovats' RI, non-polar column, custom temperature program

Data compiled by: NIST Mass Spectrometry Data Center, William E. Wallace, director

Column type Packed
Active phase SE-30
Column length (m) 1.5
Carrier gas He
Substrate Chromosorb G HP (80-100 mesh)
Column diameter (mm)
Phase thickness (μm)
Program not specified
I 1880.
ReferenceRamsey, Lee, et al., 1980
Comment MSDC-RI

References

Donnelly, Drewes, et al., 1990
Donnelly, J.R.; Drewes, L.A.; Johnson, R.L.; Munslow, W.D.; Knapp, K.K.; Sovocool, G.W.,
Purity and heat of fusion data for environmental standards as determined by differential scanning calorimetry,
Thermochim. Acta, 1990, 167, 2, 155, https://doi.org/10.1016/0040-6031(90)80476-F
. [all data]
Plato and Glasgow, 1969
Plato, C.; Glasgow, A.R., Jr.,
Differential scanning calorimetry as a general method for determining the purity and heat of fusion of high-purity organic chemicals. Application to 95 compounds,
Anal. Chem., 1969, 41, 2, 330, https://doi.org/10.1021/ac60271a041
. [all data]
Stephenson and Malanowski, 1987
Stephenson, Richard M.; Malanowski, Stanislaw,
Handbook of the Thermodynamics of Organic Compounds, 1987, https://doi.org/10.1007/978-94-009-3173-2
. [all data]
Donnelly, Drewes, et al., 1990, 2
Donnelly, J.R.; Drewes, L.A.; Johnson, R.L.; Munslow, W.D.; Knapp, K.K.; Sovocool, G.W.,
Purity and heat of fusion data for environmental standards as determined by differential scanning calorimetry,
Thermochimica Acta, 1990, 167, 2, 155-187, https://doi.org/10.1016/0040-6031(90)80476-F
. [all data]