Estazolam
- Formula: C16H11ClN4
- Molecular weight: 294.738
- IUPAC Standard InChIKey: CDCHDCWJMGXXRH-UHFFFAOYSA-N
- CAS Registry Number: 29975-16-4
- Chemical structure:
View 3d structure (requires JavaScript / HTML 5) - Other names: 4H-[1,2,4]Triazolo[4,3-a][1,4]benzodiazepine, 8-chloro-6-phenyl-; D 40TA; Eurodin; Julodin; 4H-s-Triazolo(4,3-a)(1,4)benzodiazepine, 8-chloro-6-phenyl-; 8-Chloro-6-phenyl-4H-s-triazolo(4,3-a)(1,4)benzodiazepine; 8-Chloro-6-phenyl-4H-(1,2,4)triazolo(4,3-a)(1,4)benzodiazepine; Esilgan; Nuctalon; ProSom; Abbott-47631; Cannoc; Nemurel; Somnatrol; NSC 290818; U 33737; Alprazolam M (hydroxy-)-CH2O

Kovats' RI, non-polar column, isothermal

Column type | Active phase | Temperature (C) | I | Reference | Comment |
---|---|---|---|---|---|
Capillary | BP-1 | 250. | 2893. | Japp, Garthwaite, et al., 1988 | 25. m/0.22 mm/0.25 μm, N2 |
Capillary | DB-1 | 250. | 2855. | Japp, Garthwaite, et al., 1988 | 30. m/0.53 mm/1.5 μm, N2 |
Packed | SE-30 | 280. | 2930. | Musumarra, Scarlata, et al., 1987 | N2, 1% se-30 on Anachrom ABS(80-100mesh); Column length: 2. m |

Van Den Dool and Kratz RI, non-polar column, temperature ramp

Column type | Active phase | I | Reference | Comment |
---|---|---|---|---|
Capillary | VF-5MS | 2987.8 | Tretyakov, 2014 | 30. m/0.25 mm/0.25 μm, He; Tstart: 60. C; Tend: 270. C |

Normal alkane RI, non-polar column, temperature ramp

Column type | Active phase | I | Reference | Comment |
---|---|---|---|---|
Capillary | BP-1 | 2897. | MHA, 9999 | Tstart: 100. C; Tend: 300. C |
Capillary | DB-5 | 2893. | Zamechnik, Ethier, et al., 1989 | 15. m/0.25 mm/0.25 μm, He, 150. C @ 1. min, 10. K/min; Tend: 260. C |

References

Japp, Garthwaite, et al., 1988
Japp, M.; Garthwaite, K.; Geeson, A.V.; Osselton, M.D.,
Collection of Analytical Data for Benzodiazepines and Benzophenones,
J. Chromatogr., 1988, 439, 2, 317-339, https://doi.org/10.1016/S0021-9673(01)83844-9
. [all data]
Musumarra, Scarlata, et al., 1987
Musumarra, G.; Scarlata, G.; Romano, G.; Cappello, G.; Clementi, S.; Giulietti, G.,
Qualitative organic analysis. Part 2. Identification of drugs by principal components analysis of standardized TLC data in four eluent systems and of retention indices on SE 30,
J. Anal. Toxicol., 1987, 11, 4, 154-163, https://doi.org/10.1093/jat/11.4.154
. [all data]
Tretyakov, 2014
Tretyakov, K.V.,
Retention Data. NIST Mass Spectrometry Data Center., NIST Mass Spectrometry Data Center, 2014. [all data]
MHA, 9999
MHA, Directorate of ForensicScience.,
Forensic Toxicology, 9999. [all data]
Zamechnik, Ethier, et al., 1989
Zamechnik, J.; Ethier, J.-C.; Neville, G.A.,
Benzodiazepines- an extensive collection of mass spectra,
J. Can. Soc. Forensic Sci., 1989, 22, 3, 233-259, https://doi.org/10.1080/00085030.1989.10757437
. [all data]