1,2-Dibromocyclooctane
- Formula: C8H14Br2
- Molecular weight: 270.005
- IUPAC Standard InChIKey: BOESCCYXMLOHNO-UHFFFAOYSA-N
- CAS Registry Number: 29974-69-4
- Chemical structure:
View 3d structure (requires JavaScript / HTML 5) - Stereoisomers:

Phase change data

Data compiled as indicated in comments:
AC - William E. Acree, Jr., James S. Chickos
ALS - Hussein Y. Afeefy, Joel F. Liebman, and Stephen E. Stein
Enthalpy of vaporization
ΔvapH (kJ/mol) | Temperature (K) | Method | Reference | Comment |
---|---|---|---|---|
50.3 | 307. | A | Stephenson and Malanowski, 1987 | Based on data from 292. to 354. K. See also Lister, 1941.; AC |
54.543 | 300. | V | Lister, 1941 | ALS |

Reaction thermochemistry data

Data compiled by: Hussein Y. Afeefy, Joel F. Liebman, and Stephen E. Stein
Individual Reactions
By formula: Br2 + C8H14 = C8H14Br2
Quantity | Value | Units | Method | Reference | Comment |
---|---|---|---|---|---|
ΔrH° | -122.63 | kJ/mol | Cm | Lister, 1941 | gas phase; Heat of bromination at 300 K |

References

Stephenson and Malanowski, 1987
Stephenson, Richard M.; Malanowski, Stanislaw,
Handbook of the Thermodynamics of Organic Compounds, 1987, https://doi.org/10.1007/978-94-009-3173-2
. [all data]
Lister, 1941
Lister, M.W.,
Heats of organic reactions. X. Heats of bromination of cyclic olefins,
J. Am. Chem. Soc., 1941, 63, 143-149. [all data]