1,2-Dibromocycloheptane
- Formula: C7H12Br2
- Molecular weight: 255.978
- IUPAC Standard InChIKey: PQKOJNVKGNOTKZ-UHFFFAOYSA-N
- CAS Registry Number: 29974-68-3
- Chemical structure:
View 3d structure (requires JavaScript / HTML 5) - Stereoisomers:

Phase change data

Data compiled as indicated in comments:
AC - William E. Acree, Jr., James S. Chickos
ALS - Hussein Y. Afeefy, Joel F. Liebman, and Stephen E. Stein
Enthalpy of vaporization
ΔvapH (kJ/mol) | Temperature (K) | Method | Reference | Comment |
---|---|---|---|---|
50.3 | 307. | A | Stephenson and Malanowski, 1987 | Based on data from 292. to 353. K. See also Lister, 1941 and Kkykj and Repas, 1973.; AC |
52.015 | 300. | V | Lister, 1941 | ALS |

Reaction thermochemistry data

Data compiled by: Hussein Y. Afeefy, Joel F. Liebman, and Stephen E. Stein
Individual Reactions
By formula: C7H12 + Br2 = C7H12Br2
Quantity | Value | Units | Method | Reference | Comment |
---|---|---|---|---|---|
ΔrH° | -127.4 | kJ/mol | Cm | Lister, 1941 | gas phase; Heat of bromination at 300 K |

References

Stephenson and Malanowski, 1987
Stephenson, Richard M.; Malanowski, Stanislaw,
Handbook of the Thermodynamics of Organic Compounds, 1987, https://doi.org/10.1007/978-94-009-3173-2
. [all data]
Lister, 1941
Lister, M.W.,
Heats of organic reactions. X. Heats of bromination of cyclic olefins,
J. Am. Chem. Soc., 1941, 63, 143-149. [all data]
Kkykj and Repas, 1973
Kkykj, J.; Repas, M.,
Petrochemia, 1973, 13, 179. [all data]