Cyclopentane, 1,2-dibromo-
- Formula: C5H8Br2
- Molecular weight: 227.925
- IUPAC Standard InChIKey: LJCGLSZQABMYGU-UHFFFAOYSA-N
- CAS Registry Number: 29974-65-0
- Chemical structure:
View 3d structure (requires JavaScript / HTML 5) - Stereoisomers:
- Other names: 1,2 Dibromocyclopentane

Phase change data

Data compiled by: Hussein Y. Afeefy, Joel F. Liebman, and Stephen E. Stein
Enthalpy of vaporization
ΔvapH (kJ/mol) | Temperature (K) | Method | Reference |
---|---|---|---|
47.815 | 300. | V | Lister, 1941 |

References

Lister, 1941
Lister, M.W.,
Heats of organic reactions. X. Heats of bromination of cyclic olefins,
J. Am. Chem. Soc., 1941, 63, 143-149. [all data]