Ethylene glycol bis(3-aminopropyl) ether
- Formula: C8H20N2O2
- Molecular weight: 176.2566
- IUPAC Standard InChIKey: POTQBGGWSWSMCX-UHFFFAOYSA-N
- CAS Registry Number: 2997-01-5
- Chemical structure:
View 3d structure (requires JavaScript / HTML 5) - Other names: 1-Propanamine, 3,3'-[1,2-ethanediylbis(oxy)]bis-; 3,3'-(Ethylenedioxy)bispropylamine; Propylamine, 3,3'-(ethylenedioxy)bis-; Di(3-aminopropoxy)ethane

Phase change data

Data compiled by: Thermodynamics Research Center, NIST Boulder Laboratories, Chris Muzny director
Quantity | Value | Units | Method | Reference | Comment |
---|---|---|---|---|---|
Tfus | 251.2 ± 0.9 | K | AVG | N/A | Average of 6 values; Individual data points |

References

No reference data available.