1,1,2,2,3,4-hexafluoro-3,4-bis(trifluoromethyl)cyclobutane
- Formula: C6F12
- Molecular weight: 300.0450
- IUPAC Standard InChIKey: RBTROQHBNLSUTL-UHFFFAOYSA-N
- CAS Registry Number: 2994-71-0
- Chemical structure:
View 3d structure (requires JavaScript / HTML 5) - Other names: Perfluoro(1,2-dimethylcyclobutane)

Phase change data

Data compiled as indicated in comments:
TRC - Thermodynamics Research Center, NIST Boulder Laboratories, Chris Muzny director
AC - William E. Acree, Jr., James S. Chickos
Quantity | Value | Units | Method | Reference | Comment |
---|---|---|---|---|---|
Ttriple | 231.85 | K | N/A | Crowder, Taylor, et al., 1967 | Uncertainty assigned by TRC = 0.3 K; TRC |
Enthalpy of vaporization
ΔvapH (kJ/mol) | Temperature (K) | Method | Reference | Comment |
---|---|---|---|---|
32.1 | 257. | A | Stephenson and Malanowski, 1987 | Based on data from 242. to 318. K.; AC |

References

Crowder, Taylor, et al., 1967
Crowder, G.A.; Taylor, Z.L.; Reed, T.M.; Young, J.A.,
Vapor Pressures and Triple Point Temp. for Several Pure Fluorocarbons fluorocarbons,
J. Chem. Eng. Data, 1967, 12, 481. [all data]
Stephenson and Malanowski, 1987
Stephenson, Richard M.; Malanowski, Stanislaw,
Handbook of the Thermodynamics of Organic Compounds, 1987, https://doi.org/10.1007/978-94-009-3173-2
. [all data]