3-Phenyl-benzofuran
- Formula: C14H10O
- Molecular weight: 194.2286
- IUPAC Standard InChIKey: SSYBGLWXGRWEFE-UHFFFAOYSA-N
- CAS Registry Number: 29909-72-6
- Chemical structure:
View 3d structure (requires JavaScript / HTML 5) - Other names: 3-Phenylbenzo[b]furan

Lee's RI, non-polar column, temperature ramp

Column type | Active phase | I | Reference | Comment |
---|---|---|---|---|
Capillary | HP-5 | 296.1 | Shao, Wang, et al., 2006 | 30. m/0.3 mm/0.25 μm, He, 50. C @ 5. min, 5. K/min, 200. C @ 15. min |

References

Shao, Wang, et al., 2006
Shao, X.; Wang, G.; Sun, Y.; Zhang, R.; Xie, K.; Liu, H.,
Determination and Characterization of the Pyrolysis Products of Isoprocarb by GC-MS,
J. Chromatogr. Sci., 2006, 44, 3, 141-147, https://doi.org/10.1093/chromsci/44.3.141
. [all data]