Magnesium dimer
- Formula: Mg2
- Molecular weight: 48.6100
- IUPAC Standard InChIKey: HZZOEADXZLYIHG-UHFFFAOYSA-N
- CAS Registry Number: 29904-79-8
- Chemical structure:
View 3d structure (requires JavaScript / HTML 5) - Permanent link for this species. Use this link for bookmarking this species for future reference.

Gas phase thermochemistry data

Quantity | Value | Units | Method | Reference | Comment |
---|---|---|---|---|---|
ΔfH°gas | 287.63 | kJ/mol | Review | Chase, 1998 | Data last reviewed in September, 1983 |
Quantity | Value | Units | Method | Reference | Comment |
S°gas,1 bar | 240.19 | J/mol*K | Review | Chase, 1998 | Data last reviewed in September, 1983 |
Gas Phase Heat Capacity (Shomate Equation)
Cp° = A + B*t + C*t2 + D*t3 +
E/t2
H° − H°298.15= A*t + B*t2/2 +
C*t3/3 + D*t4/4 − E/t + F − H
S° = A*ln(t) + B*t + C*t2/2 + D*t3/3 −
E/(2*t2) + G
Cp = heat capacity (J/mol*K)
H° = standard enthalpy (kJ/mol)
S° = standard entropy (J/mol*K)
t = temperature (K) / 1000.
View plot Requires a JavaScript / HTML 5 canvas capable browser.
Temperature (K) | 298. to 800. | 800. to 2000. | 2000. to 4000. | 4000. to 6000. |
---|---|---|---|---|
A | 21.46190 | 14.49080 | 682.8550 | -3665.920 |
B | -2.454191 | 10.38760 | -473.1830 | 1622.910 |
C | 3.197761 | -6.352520 | 119.7670 | -252.0680 |
D | -1.440731 | 1.367051 | -9.569871 | 13.37470 |
E | 0.294835 | 1.196491 | -474.4530 | 6641.450 |
F | 282.2990 | 286.2340 | -613.7200 | 8255.660 |
G | 268.4200 | 259.8700 | 481.2200 | 833.0970 |
H | 287.6250 | 287.6250 | 287.6250 | 287.6250 |
Reference | Chase, 1998 | Chase, 1998 | Chase, 1998 | Chase, 1998 |
Comment | Data last reviewed in September, 1983 | Data last reviewed in September, 1983 | Data last reviewed in September, 1983 | Data last reviewed in September, 1983 |

Gas phase ion energetics data

Data evaluated by: Edward P. Hunter and Sharon G. Lias
Quantity | Value | Units | Method | Reference | Comment |
---|---|---|---|---|---|
Proton affinity (review) | 919. | kJ/mol | N/A | Hunter and Lias, 1998 | |
Quantity | Value | Units | Method | Reference | Comment |
Gas basicity | 886.5 | kJ/mol | N/A | Hunter and Lias, 1998 |

Constants of diatomic molecules

Data compiled by: Klaus P. Huber and Gerhard H. Herzberg
Data collected through March, 1977
Symbol | Meaning |
---|---|
State | electronic state and / or symmetry symbol |
Te | minimum electronic energy (cm-1) |
ωe | vibrational constant – first term (cm-1) |
ωexe | vibrational constant – second term (cm-1) |
ωeye | vibrational constant – third term (cm-1) |
Be | rotational constant in equilibrium position (cm-1) |
αe | rotational constant – first term (cm-1) |
γe | rotation-vibration interaction constant (cm-1) |
De | centrifugal distortion constant (cm-1) |
βe | rotational constant – first term, centrifugal force (cm-1) |
re | internuclear distance (Å) |
Trans. | observed transition(s) corresponding to electronic state |
ν00 | position of 0-0 band (units noted in table) |
State | Te | ωe | ωexe | ωeye | Be | αe | γe | De | βe | re | Trans. | ν00 |
---|---|---|---|---|---|---|---|---|---|---|---|---|
C (1Σu+) | [0.1354] 1 | [0.4E-6] 1 | [3.222] 1 | C ← X V | [38048.8] 1 Z | |||||||
↳Balfour and Douglas, 1970 | ||||||||||||
B (1Πu) 2 | B ← X | |||||||||||
↳Weniger, 1964; Edelhoff, Kusch, et al., 1968; Balfour and Douglas, 1970 | ||||||||||||
A 1Σu+ | 26068.76 | 190.615 Z | 1.1456 3 | 0.001772 | 0.147999 | 0.0013164 | 0.1474E-5 | 0.334E-6 4 | 3.08186 | A ↔ X 5 6 V | 26138.63 Z | |
↳Hamada, 1931; missing citation; missing citation | ||||||||||||
X 1Σg+ | 0 | 51.121 Z | 1.645 7 | 0.01624 | 0.09287 | 0.003776 8 | 1.217E-6 9 | 3.8905 | 10 11 |

References

Chase, 1998
Chase, M.W., Jr.,
NIST-JANAF Themochemical Tables, Fourth Edition,
J. Phys. Chem. Ref. Data, Monograph 9, 1998, 1-1951. [all data]
Hunter and Lias, 1998
Hunter, E.P.; Lias, S.G.,
Evaluated Gas Phase Basicities and Proton Affinities of Molecules: An Update,
J. Phys. Chem. Ref. Data, 1998, 27, 3, 413-656, https://doi.org/10.1063/1.556018
. [all data]
Balfour and Douglas, 1970
Balfour, W.J.; Douglas, A.E.,
Absorption spectrum of the Mg2 molecule,
Can. J. Phys., 1970, 48, 901. [all data]
Weniger, 1964
Weniger, S.,
Spectre d'absorption de la vapeur de magnesium dans l'ultra-violet proche,
J. Phys. (Paris), 1964, 25, 946. [all data]
Edelhoff, Kusch, et al., 1968
Edelhoff, B.; Kusch, H.J.; Lochte-Holtgreven, W.,
Untersuchung der absorption in der umgebung der MgI-resonanzlinie λ = 2852 Å im kingschen ofen,
Rev. Roum. Phys., 1968, 13, 2, 125-135. [all data]
Hamada, 1931
Hamada, H.,
III. On the molecular spectra of mercury, zinc, cadmium, magnesium, and thallium,
Philos. Mag., 1931, 12, 50. [all data]
Balfour and Whitlock, 1972
Balfour, W.J.; Whitlock, R.F.,
Rotational dependence of Franck-Condon factors in the A1Σu+ ← X1Σg+ system of 24Mg2,
Can. J. Phys., 1972, 50, 1648. [all data]
Brewer and Wang, 1971
Brewer, L.; Wang, J.L.-F.,
Absorption spectrum of the Mg2 molecule in solid rare gases,
J. Mol. Spectrosc., 1971, 40, 95. [all data]
Knight and Ebener, 1976
Knight, L.B.; Ebener, M.A.,
Matrix isolation of Mg2 and Mgn molecules in neon, argon, and nitrogen hosts,
J. Mol. Spectrosc., 1976, 61, 412. [all data]
Li and Stwalley, 1973
Li, K.C.; Stwalley, W.C.,
Vibrational levels near dissociation in Mg2 and long-range forces,
J. Chem. Phys., 1973, 59, 4423. [all data]
Brett and Chan, 1972
Brett, A.C.; Chan, C.,
The Mg2 potential: a curve fitting study,
Can. J. Phys., 1972, 50, 1587. [all data]
Muhlhausen and Konowalow, 1975
Muhlhausen, C.W.; Konowalow, D.D.,
Hybrid potentials for the 1Σg+ state of Mg2,
Chem. Phys., 1975, 7, 143. [all data]
Stwalley, 1971
Stwalley, W.C.,
Polarizability and long-range interactions of magnesium atoms,
J. Chem. Phys., 1971, 54, 4517. [all data]