1,2-Diphenylcyclopropane
- Formula: C15H14
- Molecular weight: 194.2717
- IUPAC Standard InChIKey: ZSIYTDQNAOYUNE-UHFFFAOYSA-N
- CAS Registry Number: 29881-14-9
- Chemical structure:
View 3d structure (requires JavaScript / HTML 5) - Stereoisomers:
- Other names: Benzene, 1,1'-(1,2-cyclopropanediyl)bis-

Phase change data

Data compiled by: Robert L. Brown and Stephen E. Stein
Reduced pressure boiling point
Tboil (K) | Pressure (bar) | Reference |
---|---|---|
449. to 452. | 0.020 | Frinton Laboratories Inc., 1986 |

References

Frinton Laboratories Inc., 1986
Frinton Laboratories Inc.,
Catalog Number 11, Frinton Laboratories Inc., Vineland, NJ, 1986, 99. [all data]