Cyclobutanecarboxaldehyde
- Formula: C5H8O
- Molecular weight: 84.1164
- IUPAC Standard InChIKey: INVYSLWXPIEDIQ-UHFFFAOYSA-N
- CAS Registry Number: 2987-17-9
- Chemical structure:
View 3d structure (requires JavaScript / HTML 5) - Permanent link for this species. Use this link for bookmarking this species for future reference.

Phase change data

Data compiled by: Thermodynamics Research Center, NIST Boulder Laboratories, Chris Muzny director
Quantity | Value | Units | Method | Reference | Comment |
---|---|---|---|---|---|
Tboil | 387. | K | N/A | Slobodin and Blinova, 1953 | Uncertainty assigned by TRC = 3. K |

References

Slobodin and Blinova, 1953
Slobodin, Ya.M.; Blinova, M.V.,
Spirohexane,
Zh. Obshch. Khim., 1953, 23, 1994-7. [all data]