Butanal, 3,3-dimethyl-
- Formula: C6H12O
- Molecular weight: 100.1589
- IUPAC Standard InChIKey: LTNUSYNQZJZUSY-UHFFFAOYSA-N
- CAS Registry Number: 2987-16-8
- Chemical structure:
View 3d structure (requires JavaScript / HTML 5) - Species with the same structure:
- Other names: 3,3-Dimethylbutanal; 3,3-dimethylbutyraldehyde

Phase change data

Data compiled by: Thermodynamics Research Center, NIST Boulder Laboratories, Chris Muzny director
Quantity | Value | Units | Method | Reference | Comment |
---|---|---|---|---|---|
Tboil | 375.9 | K | N/A | Pomerantz, 1952 | Uncertainty assigned by TRC = 2. K |
Tboil | 376. | K | N/A | Schmerling, 1946 | Uncertainty assigned by TRC = 4. K |
Tboil | 380.15 | K | N/A | Cook, 1943 | Uncertainty assigned by TRC = 3. K |

Reaction thermochemistry data

Data compiled as indicated in comments:
B - John E. Bartmess
ALS - Hussein Y. Afeefy, Joel F. Liebman, and Stephen E. Stein
Individual Reactions
C6H11O- + =
By formula: C6H11O- + H+ = C6H12O
Quantity | Value | Units | Method | Reference | Comment |
---|---|---|---|---|---|
ΔrH° | 360.6 ± 2.4 | kcal/mol | D-EA | Zimmerman, Reed, et al., 1977 | gas phase; B |
Quantity | Value | Units | Method | Reference | Comment |
ΔrG° | 354.1 ± 2.7 | kcal/mol | H-TS | Zimmerman, Reed, et al., 1977 | gas phase; B |
By formula: H2O + C8H18O2 = C6H12O + 2CH4O
Quantity | Value | Units | Method | Reference | Comment |
---|---|---|---|---|---|
ΔrH° | 7.968 ± 0.035 | kcal/mol | Eqk | Wiberg and Squires, 1981 | liquid phase; ALS |

Gas phase ion energetics data

Data compiled as indicated in comments:
B - John E. Bartmess
LLK - Sharon G. Lias, Rhoda D. Levin, and Sherif A. Kafafi
Ionization energy determinations
IE (eV) | Method | Reference | Comment |
---|---|---|---|
9.610 ± 0.005 | PE | Hernandez, Masclet, et al., 1977 | LLK |
De-protonation reactions
C6H11O- + =
By formula: C6H11O- + H+ = C6H12O
Quantity | Value | Units | Method | Reference | Comment |
---|---|---|---|---|---|
ΔrH° | 360.6 ± 2.4 | kcal/mol | D-EA | Zimmerman, Reed, et al., 1977 | gas phase; B |
Quantity | Value | Units | Method | Reference | Comment |
ΔrG° | 354.1 ± 2.7 | kcal/mol | H-TS | Zimmerman, Reed, et al., 1977 | gas phase; B |

References

Pomerantz, 1952
Pomerantz, P.,
Synthesis and physical properties of n-heptane and 2,2,4-trimethylpentane,
J. Res. Natl. Bur. Stand. (U. S.), 1952, 48, 76-81. [all data]
Schmerling, 1946
Schmerling, L.,
Condensation of Saturated Halides with Unsaturated Compounds II. The Condensation of ALkyl Halides with Monohaloolefins,
J. Am. Chem. Soc., 1946, 68, 1650-4. [all data]
Cook, 1943
Cook, N.C.,
The polymerization of tetramethylethylene hydrogenation studies., Ph.D. Thesis, Penn. State Univ., Univ. Park, PA, 1943. [all data]
Zimmerman, Reed, et al., 1977
Zimmerman, A.H.; Reed, K.J.; Brauman, J.I.,
Photodetachment of electrons from enolate anions. Gas phase electron affinities of enolate radicals,
J. Am. Chem. Soc., 1977, 99, 7203. [all data]
Wiberg and Squires, 1981
Wiberg, K.B.; Squires, R.R.,
Thermochemical studies of carbonyl reactions. 2. Steric effects in acetal and ketal hydrolysis,
J. Am. Chem. Soc., 1981, 103, 4473-4478. [all data]