Perhydroanthracene, (4aα, 8aβ, 9aα, 10aβ)-
- Formula: C14H24
- Molecular weight: 192.3404
- IUPAC Standard InChIKey: GVJFFQYXVOJXFI-KPWCQOOUSA-N
- CAS Registry Number: 29863-91-0
- Chemical structure:
View 3d structure (requires JavaScript / HTML 5) - Stereoisomers:
- Anthracene, tetradecahydro-, (4aα,8aα,9aβ,10aα)-
- Anthracene, tetradecahydro-, (4aα,8aα,9aα,10aα)-
- Perhydroanthracene, (4aα, 8aα, 9aα, 10aβ)-
- trans-anti-trans-Tetra-decahydroanthracene
- Anthracene, tetradecahydro-
- Tricyclo[8.4.0.0(3,8)]dodecane, isomer # 1
- Tricyclo[8.4.0.0(3,8)]dodecane, isomer # 2
- Tricyclo[8.4.0.0(3,8)]dodecane, isomer # 3
- Tricyclo[8.4.0.0(3,8)]dodecane, isomer # 4
- Tricyclo[8.4.0.0(3,8)]dodecane, isomer # 5
- Other names: Tetradecahydroanthracene-, cis-anti-cis-; cis,anti,cis-Perhydroanthracene

Reaction thermochemistry data

Data compiled by: Hussein Y. Afeefy, Joel F. Liebman, and Stephen E. Stein
Individual Reactions
By formula: C14H24 = C14H24
Quantity | Value | Units | Method | Reference | Comment |
---|---|---|---|---|---|
ΔrH° | -23.3 ± 1.2 | kJ/mol | Eqk | Allinger and Wuesthoff, 1971 | gas phase |

References

Allinger and Wuesthoff, 1971
Allinger, N.L.; Wuesthoff, M.T.,
Conformational analysis. LXXIII. The perhydroanthracenes. An equilibration study,
J. Org. Chem., 1971, 36, 2051-2053. [all data]