Carbamazepine
- Formula: C15H12N2O
- Molecular weight: 236.2686
- IUPAC Standard InChIKey: FFGPTBGBLSHEPO-UHFFFAOYSA-N
- CAS Registry Number: 298-46-4
- Chemical structure:
View 3d structure (requires JavaScript / HTML 5) - Other names: 5H-Dibenz[b,f]azepine-5-carboxamide; Carbamazepen; Carbazepine; Finlepsin; G 32883; Geigy 32883; Karbamazepin; Neurotol; Tegretal; Tegretol; 5-Carbamoyl-5H-Dibenz[b,f]azepine; Carbamezepine; 5-Carbomoyl-5H-dibenzo(b,f)azepine; Biston; Lexin; Stazepine; 5-Carbamoyl-5H-dibenzo(b,f)azepine; 5-Carbamoyldibenzo(b,f)azepine; 5-Carbamyl-5H-dibenzo(b,f)azepine; 5-Carbamyldibenzo(b,f)azepine; Stazepin; Telesmin; Timonil; Epitol; Iminostilbene-N-carboxamide; 5H-Dibenz[b,f]azepine-5-carboxamine; Calepsin; Carbelan; Sirtal; Amizepin; Carbatrol; Equetro; NSC 169864; 5H-Dibenzo[b,f]azepine-5-carboxamide; 5H-dibenz[b,f]azepine-5-carboxamide (carbamazepine)

Phase change data

Data compiled by: William E. Acree, Jr., James S. Chickos
Enthalpy of fusion
ΔfusH (kJ/mol) | Temperature (K) | Method | Reference |
---|---|---|---|
25.6 | 465.3 | DSC | Good and Rodriguez-Hornedo, 2009 |

Kovats' RI, non-polar column, isothermal

View large format table.

Column type Active phase Temperature (C) I Reference Comment
PackedSE-30240.2310.Musumarra, Scarlata, et al., 1987N2, 1% se-30 on Anachrom ABS(80-100mesh); Column length: 2. m
CapillarySPB-1250.2337.Lora-Tamayo, Rams, et al., 1986He; Column length: 25. m; Column diameter: 0.20 mm

Kovats' RI, non-polar column, temperature ramp

View large format table.

Column type Active phase I Reference Comment
PackedOV-1012285.Maurer, 1990N2, Chromosorb G HP, 100. C @ 3. min, 30. K/min, 310. C @ 5. min; Column length: 0.6 m

Kovats' RI, non-polar column, custom temperature program

View large format table.

Column type Active phase I Reference Comment
PackedOV-1012340.McLinden and Stenhouse, 1979N2, Chromosorb W; Column length: 2. m; Program: not specified

Van Den Dool and Kratz RI, non-polar column, temperature ramp

View large format table.

Column type Active phase I Reference Comment
CapillaryVF-5MS2397.4Tretyakov, 201430. m/0.25 mm/0.25 μm, He; Tstart: 60. C; Tend: 270. C
CapillarySPB-12296.Christ, Noomano, et al., 198830. m/0.75 mm/1.0 μm, He, 10. K/min, 280. C @ 12. min; Tstart: 160. C
CapillaryDB-12259.Perrigo, Peel, et al., 198515. m/0.32 mm/0.25 μm, He, 8. K/min, 280. C @ 5. min; Tstart: 120. C
CapillaryDB-12259.Perrigo, Ballantyne, et al., 198415. m/0.25 mm/0.25 μm, He, 8. K/min, 280. C @ 5. min; Tstart: 120. C
PackedSE-302290.Perrigo and Peel, 1981N2, Chromosorb W, 130. C @ 2. min, 8. K/min, 290. C @ 8. min; Column length: 1.8 m

Normal alkane RI, non-polar column, temperature ramp

View large format table.

Column type Active phase I Reference Comment
CapillaryDB-12275.Sharp, 198715. m/0.25 mm/0.25 μm, He, 130. C @ 1. min, 10. K/min, 290. C @ 10. min
PackedSE-302310.Marozzi, Gambaro, et al., 1982Gas Chrom P, 2.5 K/min; Column length: 2. m; Tstart: 120. C; Tend: 200. C

Normal alkane RI, non-polar column, custom temperature program

View large format table.

Column type Active phase I Reference Comment
CapillaryCP Sil 5 CB2270.Bogusz, Bialka, et al., 198610. m/0.53 mm/5.2 μm; Program: 100 0C (2 min) 20 0C/min -> 180 0C 7.5 0C/min -> 280 0C (6 min)
CapillaryCP Sil 5 CB2290.Bogusz, Bialka, et al., 198610. m/0.53 mm/5.2 μm; Program: not specified
OtherMethyl Silicone2290.Ardrey and Moffat, 1981Program: not specified

References

Good and Rodriguez-Hornedo, 2009
Good, David J.; Rodriguez-Hornedo, Nair,
Solubility Advantage of Pharmaceutical Cocrystals,
Crystal Growth & Design, 2009, 9, 5, 2252-2264, https://doi.org/10.1021/cg801039j
. [all data]