1,3-Butadiene, 1,4-dichloro-
- Formula: C4H4Cl2
- Molecular weight: 122.981
- IUPAC Standard InChIKey: LDZSRRMBFGBOAE-ZPUQHVIOSA-N
- CAS Registry Number: 2984-42-1
- Chemical structure:
View 3d structure (requires JavaScript / HTML 5) - Species with the same structure:

Normal alkane RI, non-polar column, temperature ramp

Column type | Active phase | I | Reference | Comment |
---|---|---|---|---|
Capillary | OV-101 | 827. | Zenkevich, 2005 | 25. m/0.20 mm/0.10 μm, N2/He, 6. K/min; Tstart: 50. C; Tend: 250. C |

References

Zenkevich, 2005
Zenkevich, I.G.,
Experimentally measured retention indices., 2005. [all data]