silver nitrate, complex with 2,4-dimethylpyridine (1:2)

Phase change data

Data compiled by: Thermodynamics Research Center, NIST Boulder Laboratories, Chris Muzny director

Quantity Value Units Method Reference Comment
Tfus393.KN/AAkhavein and House, 1970Uncertainty assigned by TRC = 1. K

In addition to the Thermodynamics Research Center (TRC) data available from this site, much more physical and chemical property data is available from the following TRC products:

References

Akhavein and House, 1970
Akhavein, A.; House, J.E., thermal studies on solid complexes of silver nitrate with substituted pyridines, J. Inorg. Nucl. Chem., 1970, 32, 1479. [all data]