Butane, 1,2:3,4-diepoxy-, (.+/-.)-
- Formula: C4H6O2
- Molecular weight: 86.0892
- IUPAC Standard InChIKey: ZFIVKAOQEXOYFY-IMJSIDKUSA-N
- CAS Registry Number: 298-18-0
- Chemical structure:
View 3d structure (requires JavaScript / HTML 5) - Stereoisomers:
- Other names: 2,2'-Bioxirane, (R*,R*)-(.+/-.)-; (.+/-.)-1,2:3,4-Diepoxybutane; Butane, 1,2:3,4-diepoxy-, DL-; DL-Diepoxybutane; Butadiene diepoxide, dl-; Butane, (.+/-.)-1,2:3,4-diepoxy-; (R*,R*)-(.+/-.)-2,2'-Bioxirane; dl-Butadiene dioxide; 1,2:3,4-Dianhydro-dl-threitol; dl-1,2:3,4-Diepoxybutane; 1,2:3,4-Diepoxybutane, dl-; 2,2'-Bioxirane, (2R,2'R)-rel-; 1,2,3,4-diepoxybutane

Phase change data

Data compiled as indicated in comments:
BS - Robert L. Brown and Stephen E. Stein
TRC - Thermodynamics Research Center, NIST Boulder Laboratories, Chris Muzny director
Quantity | Value | Units | Method | Reference | Comment |
---|---|---|---|---|---|
Tboil | 417.2 | K | N/A | Weast and Grasselli, 1989 | BS |
Tboil | 417.6 | K | N/A | Buckingham and Donaghy, 1982 | BS |
Quantity | Value | Units | Method | Reference | Comment |
Tfus | 277. | K | N/A | Buckingham and Donaghy, 1982 | BS |
Tfus | 260.4 | K | N/A | Anonymous, 1955 | Uncertainty assigned by TRC = 0.6 K; TRC |
Reduced pressure boiling point
Tboil (K) | Pressure (bar) | Reference | Comment |
---|---|---|---|
330.2 | 0.033 | Aldrich Chemical Company Inc., 1990 | BS |
317.6 | 0.0180 | Buckingham and Donaghy, 1982 | BS |

References

Weast and Grasselli, 1989
CRC Handbook of Data on Organic Compounds, 2nd Editon, Weast,R.C and Grasselli, J.G., ed(s)., CRC Press, Inc., Boca Raton, FL, 1989, 1. [all data]
Buckingham and Donaghy, 1982
Buckingham, J.; Donaghy, S.M.,
Dictionary of Organic Compounds: Fifth Edition, Chapman and Hall, New York, 1982, 1. [all data]
Anonymous, 1955
Anonymous, R.,
, Am. Pet. Inst. Res. Proj. 45, Tech. Rep. 14, No. 1, Ohio State Univ., 1955. [all data]
Aldrich Chemical Company Inc., 1990
Aldrich Chemical Company Inc.,
Catalog Handbook of Fine Chemicals, Aldrich Chemical Company, Inc., Milwaukee WI, 1990, 1. [all data]