Undecane, 4-methyl-
- Formula: C12H26
- Molecular weight: 170.3348
- IUPAC Standard InChIKey: KNMXZGDUJVOTOC-UHFFFAOYSA-N
- CAS Registry Number: 2980-69-0
- Chemical structure:
View 3d structure (requires JavaScript / HTML 5) - Other names: 4-Methylundecane

Phase change data

Data compiled as indicated in comments:
TRC - Thermodynamics Research Center, NIST Boulder Laboratories, Chris Muzny director
AC - William E. Acree, Jr., James S. Chickos
Quantity | Value | Units | Method | Reference | Comment |
---|---|---|---|---|---|
Tboil | 483.0 | K | N/A | Gibbons, 1941 | Uncertainty assigned by TRC = 3. K; TRC |
Quantity | Value | Units | Method | Reference | Comment |
Tfus | 206.5 | K | N/A | Petrov, Sergienko, et al., 1959 | Uncertainty assigned by TRC = 2. K; TRC |
Enthalpy of vaporization
ΔvapH (kJ/mol) | Temperature (K) | Method | Reference | Comment |
---|---|---|---|---|
51.6 | 374. | A | Stephenson and Malanowski, 1987 | Based on data from 359. to 481. K.; AC |

References

Gibbons, 1941
Gibbons, L.C.,
, Ph.D. Thesis, Ohio State Univ., Columbus, OH, 1941. [all data]
Petrov, Sergienko, et al., 1959
Petrov, A.A.; Sergienko, S.R.; Nechitailo, N.A.; Tsedilina, A.L.,
Izv. Akad. Nauk SSSR, 1959, 1959, 1091-7. [all data]
Stephenson and Malanowski, 1987
Stephenson, Richard M.; Malanowski, Stanislaw,
Handbook of the Thermodynamics of Organic Compounds, 1987, https://doi.org/10.1007/978-94-009-3173-2
. [all data]