Disulfoton
- Formula: C8H19O2PS3
- Molecular weight: 274.404
- IUPAC Standard InChIKey: DOFZAZXDOSGAJZ-UHFFFAOYSA-N
- CAS Registry Number: 298-04-4
- Chemical structure:
View 3d structure (requires JavaScript / HTML 5) - Other names: Phosphorodithioic acid, O,O-diethyl S-[2-(ethylthio)ethyl] ester; Bay 19639; Bayer 19639; Di-Syston; Di-Syston G; Disipton; Dithiodemeton; Dithiosystox; Ekatin TD; Ethyl thiometon; Ethylthiometon B; ENT-23437; Frumin; Frumin AL; Frumin G; Glebofos; M 74; M 74 (Pesticide); O,O-Diethyl S-[2-(Ethylthio)ethyl] dithiophosphate; O,O-Diethyl S-[2-(ethylthio)ethyl] phosphorodithioate; Solvirex; Thiodemeton; VUagT 1-4; VUagT 1964; O,O-Diaethyl-S-(3-thia-pentyl)-dithiophosphat; O,O-Diaethyl-S-(2-aethylthio-aethyl)-dithiophosphat; O,O-Diethyl S-(2-eththioethyl) phosphorodithioate; O,O-Diethyl S-(2-eththioethyl) thiothionophosphate; O,O-Diethyl S-(2-ethylmercaptoethyl) dithiophosphate; O,O-Diethyl-S-(2-ethylthio-ethyl)-dithiofosfaat; O,O-Diethyl 2-ethylthioethyl phosphorodithioate; O,O-Dietil-S-(2-etiltio-etil)-ditiofosfato; Dimaz; Disulfaton; Disystox; Dithiophosphate de O,O-diethyle et de S-(2-ethylthio-ethyle); ENT 23,437; O,O-Ethyl S-2(ethylthio)ethyl phosphorodithioate; S-2-(Ethylthio)ethyl O,O-diethyl ester of phosphorodithioic acid; Insyst-D; NA 2783; Phosphorodithionic acid, S-2-(ethylthio)ethyl-O,O-diethyl ester; RCRA Waste number P039; S 276; Thiodemetron; Dution; Phosphonodithioic acid, O,O-diethyl S-[2-(ethylthio)ethyl] ester; Solvigran

Kovats' RI, non-polar column, isothermal

Column type | Active phase | Temperature (C) | I | Reference | Comment |
---|---|---|---|---|---|
Capillary | OV-1 | 160. | 1762. | Erdmann, Rochholz, et al., 1992 | |
Capillary | OV-1 | 190. | 1780. | Erdmann, Rochholz, et al., 1992 |

Kovats' RI, non-polar column, temperature ramp

Column type | Active phase | I | Reference | Comment |
---|---|---|---|---|
Capillary | DB-1 | 1783. | Hall, Whitehead, et al., 1986 | He, 6. K/min; Column length: 15. m; Column diameter: 0.25 mm; Tstart: 100. C; Tend: 270. C |
Capillary | DB-5 | 1813. | Hall, Whitehead, et al., 1986 | He, 6. K/min; Column length: 15. m; Column diameter: 0.25 mm; Tstart: 100. C; Tend: 270. C |

Kovats' RI, non-polar column, custom temperature program

Column type | Active phase | I | Reference | Comment |
---|---|---|---|---|
Packed | SE-30 | 1776. | Osselton and Snelling, 1986 | N2, Chromosorb W HP; Column length: 2. m; Program: not specified |

Normal alkane RI, non-polar column, isothermal

Column type | Active phase | Temperature (C) | I | Reference | Comment |
---|---|---|---|---|---|
Packed | OV-1 | 190. | 1790. | TSunoda, 1986 | Helium, Chromosorb W AW DMCS; Column length: 1. m |

Normal alkane RI, non-polar column, temperature ramp

Column type | Active phase | I | Reference | Comment |
---|---|---|---|---|
Packed | OV-1 | 1790. | TSunoda, 1986 | Helium, Chromosorb W AW DMCS, 4. K/min, 210. C @ 20. min; Column length: 1. m; Tstart: 140. C |

Normal alkane RI, non-polar column, custom temperature program

Column type | Active phase | I | Reference | Comment |
---|---|---|---|---|
Capillary | 5 % Phenyl methyl siloxane | 1814. | Department of Food Safety and Welfare, 2006 | 30. m/0.25 mm/0.25 μm, Helium; Program: 50 0C(1 min) 25 0C/min -> 125 0C 10 0C/min -> 300 0C (10 min) |
Capillary | Ultra-1 | 1753. | Tameo and Kiyos, 1991 | Program: not specified |

Normal alkane RI, polar column, custom temperature program

Column type | Active phase | I | Reference | Comment |
---|---|---|---|---|
Capillary | Carbowax 20M | 2480. | Tameo and Kiyos, 1991 | Program: not specified |

References

Erdmann, Rochholz, et al., 1992
Erdmann, F.; Rochholz, G.; Schütz, H.,
Retention-indices on OV-1 of approximately 170 commonly used pesticides,
Mikrochim. Acta, 1992, 106, 3-6, 219-226, https://doi.org/10.1007/BF01242093
. [all data]
Hall, Whitehead, et al., 1986
Hall, G.L.; Whitehead, W.E.; Mourer, C.R.; Shibamoto, T.,
A new gas chromatographic retention index for pesticides and related compounds,
J. Hi. Res. Chromatogr. Chromatogr. Comm., 1986, 9, 5, 266-271, https://doi.org/10.1002/jhrc.1240090503
. [all data]
Osselton and Snelling, 1986
Osselton, M.D.; Snelling, R.D.,
Chromatographic Identification of Pesticides,
J. Chromatogr., 1986, 368, 265-271, https://doi.org/10.1016/S0021-9673(00)91068-9
. [all data]
TSunoda, 1986
TSunoda, N.,
Simultaneous determination of organophosphorous pesticides in forencis chemistry by gas-liquid chromatography with hydrogen flame ionization detector,
Eisei Kagaku, 1986, 32, 2, 91-100, https://doi.org/10.1248/jhs1956.32.91
. [all data]
Department of Food Safety and Welfare, 2006
Department of Food Safety, Ministry of Health; Welfare,
Analytical methods for residual compositional substances of agricultural chemicals, feed aadditives, and veterinary drugs in foods, 2006, retrieved from http://www.mhlw.go.jp/english/topics/foodsafety/positivelist060228/de/060526-1a.pdf. [all data]
Tameo and Kiyos, 1991
Tameo, O.; Kiyos, I.,
Simultaneous determination of pesticides by capillary gas chromatography,
Cannot be traslated (in Japan), 1991, 14, 2, 109-122. [all data]