Isobenzan
- Formula: C9H4Cl8O
- Molecular weight: 411.751
- IUPAC Standard InChIKey: LRWHHSXTGZSMSN-UHFFFAOYSA-N
- CAS Registry Number: 297-78-9
- Chemical structure:
View 3d structure (requires JavaScript / HTML 5) - Other names: 4,7-Methanoisobenzofuran, 1,3,4,5,6,7,8,8-octachloro-1,3,3a,4,7,7a-hexahydro-; CP 14,957; ENT 25,545-X; Shell WL 1650; SD 4402; Telodrin; WL 1650; 948; 1,3,4,5,6,7,8,8-Octachloro-1,3,3a,4,7,7a-hexahydro-4,7-methanoisobenzofuran; ENT 25,545; Octachloro-hexahydro-methanoisobenzofuran; 1,3,4,5,6,8,8-Octachloro-1,3,3a,4,7,7a-hexahydro-4,7-methanoisobenzofuran; 1,3,4,5,6,7,8,8-Octachloro-2-oxa-3a,4,7,7a-tetrahydro-4,7-methanoindene; 1,3,4,5,6,7,10,10-Octachloro-4,7-endo-methylene-4,7,8,9-tetrahydrophthalan; OMS 206; Omtan; R 6700; Shell 4402; 4,7-Methanoisobenzofuran, 1,3,4,5,6,7,8,8-octachloro-3a,4,7,7a-tetrahydro-

Phase change data

Data compiled by: Thermodynamics Research Center, NIST Boulder Laboratories, Chris Muzny director
Quantity | Value | Units | Method | Reference | Comment |
---|---|---|---|---|---|
Tfus | 395.4 | K | N/A | Plato and Glasgow, 1969 | Uncertainty assigned by TRC = 0.2 K |

References

Plato and Glasgow, 1969
Plato, C.; Glasgow, A.R., Jr.,
Differential scanning calorimetry as a general method for determining the purity and heat of fusion of high-purity organic chemicals. Application to 95 compounds,
Anal. Chem., 1969, 41, 2, 330, https://doi.org/10.1021/ac60271a041
. [all data]