1-heptene, 2,3,3-trimethyl-
- Formula: C10H20
- Molecular weight: 140.2658
- IUPAC Standard InChIKey: XCQAMKRARZDXSG-UHFFFAOYSA-N
- CAS Registry Number: 29772-43-8
- Chemical structure:
View 3d structure (requires JavaScript / HTML 5) - Permanent link for this species. Use this link for bookmarking this species for future reference.

Phase change data

Data compiled by: Thermodynamics Research Center, NIST Boulder Laboratories, Chris Muzny director
Quantity | Value | Units | Method | Reference | Comment |
---|---|---|---|---|---|
Tboil | 427.6 | K | N/A | Gibbons, 1941 | Uncertainty assigned by TRC = 1. K |
Tboil | 427.6 | K | N/A | Cline, 1939 | Uncertainty assigned by TRC = 1. K |

References

Gibbons, 1941
Gibbons, L.C.,
, Ph.D. Thesis, Ohio State Univ., Columbus, OH, 1941. [all data]
Cline, 1939
Cline, E.T.,
The Synthesis of Type III and Type V Olefins from Dimethylbutadien- monohydrobromide, Ph.D. Dissertation, Ohio State Univ., Columbus, OH, 1939. [all data]