Methyl 4-nitrophenyl sulfone
- Formula: C7H8NO4S
- Molecular weight: 202.208
- IUPAC Standard InChIKey: XONGBDXIFQIQBN-UHFFFAOYSA-N
- CAS Registry Number: 2976-30-9
- Chemical structure:
View 3d structure (requires JavaScript / HTML 5) - Other names: Sulfone, methyl p-nitrophenyl; Methyl p-nitrophenyl sulfone; Benzene, 1-(methylsulfonyl)-4-nitro-

Reaction thermochemistry data

Data compiled by: Robert C. Dunbar
Individual Reactions
By formula: Li+ + C7H8NO4S = (Li+ • C7H8NO4S)
Quantity | Value | Units | Method | Reference | Comment |
---|---|---|---|---|---|
ΔrH° | 198. | kJ/mol | CIDC | Buncel, Decouzon, et al., 1997 |

Ion clustering data

Data compiled by: Robert C. Dunbar
Clustering reactions
By formula: Li+ + C7H8NO4S = (Li+ • C7H8NO4S)
Quantity | Value | Units | Method | Reference | Comment |
---|---|---|---|---|---|
ΔrH° | 198. | kJ/mol | CIDC | Buncel, Decouzon, et al., 1997 |

References

Buncel, Decouzon, et al., 1997
Buncel, E.; Decouzon, M.; Formento, A.; Gal, J.-F.; Herreros, M.; Li, L.; Maria, P.-C.,
Lithium-Cation and Proton Affinities of Sulfoxides and Sulfones: A Fourier Transform Ion Cyclotron Resonance Study,
J. Am. Soc. Mass Spectrom., 1997, 8, 3, 262, https://doi.org/10.1016/S1044-0305(96)00255-3
. [all data]