1,2-Dichloro-1,1,2,2-tetranitroethane

Gas phase thermochemistry data

Data compiled by: Hussein Y. Afeefy, Joel F. Liebman, and Stephen E. Stein

Quantity Value Units Method Reference Comment
Δfgas36.kJ/molCcbPepekin and Korsunskii, 1995

Condensed phase thermochemistry data

Data compiled by: Hussein Y. Afeefy, Joel F. Liebman, and Stephen E. Stein

Quantity Value Units Method Reference Comment
Δfsolid-52.3kJ/molCcbPepekin and Korsunskii, 1995

Phase change data

Data compiled by: Hussein Y. Afeefy, Joel F. Liebman, and Stephen E. Stein

Quantity Value Units Method Reference Comment
Δsub88.3kJ/molVPepekin and Korsunskii, 1995

References

Pepekin and Korsunskii, 1995
Pepekin, V.I.; Korsunskii, B.L., Thermochemistry of halopolynitroalkanes, Dokl. Phys. Chem. (Engl. Transl.), 1995, 340, 14-16, In original 342. [all data]