11-methyltridecanoic acid
- Formula: C14H28O2
- Molecular weight: 228.3709
- IUPAC Standard InChIKey: JIPTZBYHWFNYFB-UHFFFAOYSA-N
- CAS Registry Number: 29709-05-5
- Chemical structure:
View 3d structure (requires JavaScript / HTML 5) - Permanent link for this species. Use this link for bookmarking this species for future reference.

Phase change data

Data compiled by: Thermodynamics Research Center, NIST Boulder Laboratories, Chris Muzny director
Quantity | Value | Units | Method | Reference | Comment |
---|---|---|---|---|---|
Tfus | 301. | K | N/A | Liu, 1952 | Uncertainty assigned by TRC = 1.5 K |

References

Liu, 1952
Liu, S.-L.,
Fatty Acids from Lanolin, Essays and Papers in Memory of Late President Fu Ssu-Nien 199-213 1952, 1952. [all data]