2-Deoxy-2-fluoro-(d)-glucopyranose

Phase change data

Data compiled by: William E. Acree, Jr., James S. Chickos

Enthalpy of fusion

ΔfusH (kJ/mol) Temperature (K) Reference
38.2427.2Schwarz, 1996

References

Schwarz, 1996
Schwarz, Frederick P., Enthalpy of solution of carbohydrates using a modified differential scanning calorimeter, J Solution Chem, 1996, 25, 5, 471-484, https://doi.org/10.1007/BF00972993 . [all data]