α-Cuprenene
- Formula: C15H24
- Molecular weight: 204.3511
- IUPAC Standard InChIKey: DYQFFTPJVWEYMH-UHFFFAOYSA-N
- CAS Registry Number: 29621-78-1
- Chemical structure:
View 3d structure (requires JavaScript / HTML 5) - Other names: (S)-1-Methyl-4-(1,2,2-trimethylcyclopentyl)cyclohexa-1,3-diene; 1,3-Cyclohexadiene, 1-methyl-4-[(1S)-1,2,2-trimethylcyclopentyl]-; 1,3-Cyclohexadiene, 1-methyl-4-(1,2,2-trimethylcyclopentyl)-, stereoisomer; (-)-α-Cuprenene; NOTE α-Cuprenene and β-Himachalene have completly different structures but have identical spectra

Van Den Dool and Kratz RI, non-polar column, custom temperature program

Column type | Active phase | I | Reference | Comment |
---|---|---|---|---|
Capillary | HP-5MS | 1513.6 | Andriamaharavo, 2014 | 30. m/0.25 mm/0.25 μm, He; Program: 60C (1 min) => 5 C/min => 210C => 10 C/min => 280C (15 min) |
Capillary | BPX-5 | 1512. | Cardeal, da Silva, et al., 2006 | 30. m/0.25 mm/0.25 μm; Program: 35C(5min) => 3C/min => 210C => 40C/min => 240C (4min) |

Normal alkane RI, non-polar column, temperature ramp

Column type | Active phase | I | Reference | Comment |
---|---|---|---|---|
Capillary | HP-5 | 1504. | Kahriman, Tosun, et al., 2011 | 30. m/0.32 mm/0.25 μm, Helium, 60. C @ 2. min, 3. K/min; Tend: 240. C |
Capillary | DB-5 | 1555. | Pattiram, Lasekan, et al., 2011 | 30. m/0.32 mm/0.25 μm, Helium, 2. K/min; Tstart: 35. C; Tend: 200. C |
Capillary | HP-5 | 1511. | Radulovic, Dordevic, et al., 2010 | 30. m/0.25 mm/0.25 μm, Hydrogen, 5. K/min; Tstart: 70. C; Tend: 290. C |
Capillary | DB-5 | 1506. | Ho, Wang, et al., 2009 | 30. m/0.25 mm/0.25 μm, Helium, 50. C @ 2. min, 5. K/min; Tend: 250. C |

Normal alkane RI, non-polar column, custom temperature program

Column type | Active phase | I | Reference | Comment |
---|---|---|---|---|
Capillary | HP-5 | 1497. | Citron, Riclea, et al., 2011 | Program: not specified |
Capillary | HP-5 | 1505. | Citron, Riclea, et al., 2011 | Program: not specified |
Capillary | HP-5 | 1506. | Kahriman, Tosun, et al., 2011 | 30. m/0.32 mm/0.25 μm, Helium; Program: not specified |
Capillary | DB-5 | 1555. | Courtois, Paine, et al., 2009 | 30. m/0.25 mm/0.25 μm, Helium; Program: 50 0C m6 0C/min -> 140 0C 5 0C/min -> 160 0C (1 min) 10 0C/min -> 200 0C |

Normal alkane RI, polar column, custom temperature program

Column type | Active phase | I | Reference | Comment |
---|---|---|---|---|
Capillary | HP Innowax FSP | 1759. | Wedge, Klun, et al., 2009 | 60. m/0.25 mm/0.25 μm, Helium; Program: 60 0C (10 min) 4 0C/min -> 220 0C (10 min) 1 0C/min -> 240 0C (20 min) |
Capillary | HP-Innowax FSC | 1758. | Sezik E., Kocakulak E., et al., 2005 | 60. m/0.25 mm/0.25 μm, He; Program: 60C(10min) => 4C/min => 220C(10min) => 1C/min => 240C |
Capillary | Innowax | 1759. | Tunaher, Kirimer, et al., 2003 | 60. m/0.25 mm/0.25 μm, He; Program: 60C(10min) => 4C/min => 220C(10min) => 1C/min => 240C (20min) |

References

Andriamaharavo, 2014
Andriamaharavo, N.R.,
Retention Data. NIST Mass Spectrometry Data Center., NIST Mass Spectrometry Data Center, 2014. [all data]
Cardeal, da Silva, et al., 2006
Cardeal, Z.L.; da Silva, M.D.R.G.; Marriott, P.J.,
Comprehensive two-dimensional gas chromatography/mass spectrometric analysis of pepper volatiles,
Rapid Commun. Mass Spectrom., 2006, 20, 19, 2823-2836, https://doi.org/10.1002/rcm.2665
. [all data]
Kahriman, Tosun, et al., 2011
Kahriman, N.; Tosun, G.; Terzioglu, S.; Karaoglu, S.A.; Yayh, N.,
Chemical composition and antimicrobial activity of the essential oils from the flower, leaf, and stem of Senecio pandurifolis,
Rec. Nat. Prod., 2011, 5, 2, 82-91. [all data]
Pattiram, Lasekan, et al., 2011
Pattiram, P.D.; Lasekan, O.; Tan, C.P.; Zaidul, I.S.M.,
Identification of the aroma-active constituents of the essential oils of Water Dropwort (Oenanthe javanica) and Kacip Fatimah (Labisia pumilia),
Int. Food Res. J., 2011, 18, 3, 1021-1026. [all data]
Radulovic, Dordevic, et al., 2010
Radulovic, N.S.; Dordevic, N.D.; Palic, R.M.,
Volatiles of Pleurospermum austriacum (L.) Hoffm. (Apiaceae),
J. Serbian Chem. Soc., 2010, 75, 12, 1-11, https://doi.org/10.2298/JSC100323127R
. [all data]
Ho, Wang, et al., 2009
Ho, C.-L.; Wang, E.I.-C.; Su, Y.-C.,
Essential oil compositions and bioactivities of the various parts of Cinnamomum camphora Sieb. var. linallolifera Fujuta,
Journal title only in Chinese, 2009, 31, 2, 77-96. [all data]
Citron, Riclea, et al., 2011
Citron, C.A.; Riclea, R.; Brock, N.L.; Dickschat, J.S.,
Biosynthesis of acorane sesquiterpenes by Trichoderma. Electronic supplemental materials (ESI),
Royal Soc. Chem., 2011, 1-10. [all data]
Courtois, Paine, et al., 2009
Courtois, E.A.; Paine, C.E.; Blandinieres, P.-A.; Stien, D.; Bessiere, J.-M.; Houel, E.; Baraloto, C.; Chave, J.,
Diversity of the volatile organic compounds emitted by 55 species of tropical trees: a survey in French Guiana,
J. Chem. Ecol., 2009, 35, 11, 1349-1362, https://doi.org/10.1007/s10886-009-9718-1
. [all data]
Wedge, Klun, et al., 2009
Wedge, D.E.; Klun, J.A.; Tabanca, N.; Demirci, B.; Ozek, T.; Baser, K.H.C.; Liu, Z.; Zhang, S.; Cantrell, C.L.; Zhang, J.,
Bioactivity-guided fractionation and GC/MS fingerprinting of Amgelica sinensis and Angelica archangelica root components for antifungal and mosquito deterrent activity,
J. Agric. Food Chem., 2009, 57, 2, 464-470, https://doi.org/10.1021/jf802820d
. [all data]
Sezik E., Kocakulak E., et al., 2005
Sezik E.; Kocakulak E.; Baser K.H.C.; Ozek T.,
Composition of the essential oils of Juniperus oxycedrus subsp macrocarpa from Turkey,
Chem. Nat. Compd. (Engl. Transl.), 2005, 41, 3, 352-354, https://doi.org/10.1007/s10600-005-0149-0
. [all data]
Tunaher, Kirimer, et al., 2003
Tunaher, Z.; Kirimer, N.; Baser, K.H.C.,
Wood essential oils of Juniperus foetidissima Willd.,
Holzforschung, 2003, 57, 140-144. [all data]