Methyl 2-methyldecanoate
- Formula: C12H24O2
- Molecular weight: 200.3178
- IUPAC Standard InChIKey: ZWSMRUGTQTWTII-UHFFFAOYSA-N
- CAS Registry Number: 29619-64-5
- Chemical structure:
View 3d structure (requires JavaScript / HTML 5) - Other names: Decanoic acid, 2-methyl, methyl ester

Phase change data

Data compiled by: Thermodynamics Research Center, NIST Boulder Laboratories, Chris Muzny director
Quantity | Value | Units | Method | Reference | Comment |
---|---|---|---|---|---|
Tboil | 379.15 | K | N/A | Schulte, Krause, et al., 1951 | Uncertainty assigned by TRC = 2. K |

References

Schulte, Krause, et al., 1951
Schulte, K.E.; Krause, H.; Kirschner, J.,
Z. Physiol. Chem., 1951, 287, 239. [all data]