1-Methyldecahydronaphthalene
- Formula: C11H20
- Molecular weight: 152.2765
- IUPAC Standard InChIKey: NHCREQREVZBOCH-UHFFFAOYSA-N
- CAS Registry Number: 2958-75-0
- Chemical structure:
View 3d structure (requires JavaScript / HTML 5) - Stereoisomers:
- Naphthalene,decahydro-1-methyl-(1α,4aβ,8aα
- Naphthalene,decahydro-1-methyl-(1α,4aα,8aβ
- cis-Decalin, trans-1e-methyl, r-9H
- trans-Decalin, 1a-methyl
- trans-Decalin, 1e-methyl
- cis,cis-Bicyclo[4.4.0]decane, 2-methyl
- cis,trans-Bicyclo[4.4.0]decane, 2-methyl
- trans,cis-Bicyclo[4.4.0]decane, 2-methyl
- trans,trans-Bicyclo[4.4.0]decane, 2-methyl
- 1-Methyldecalin, cis
- 1-Methyldecalin, trans
- Other names: 1-Methyldecalin; α-Methyldecalin; 1-Methyldecalin, isomer 3; 1-Methyldecalin, isomer 2; 1-Methyldecalin, isomer 1; 1-Methyldecalin, isomer 4; α-Methyl-trans-Decalin

Kovats' RI, non-polar column, isothermal

Column type | Active phase | Temperature (C) | I | Reference | Comment |
---|---|---|---|---|---|
Capillary | OV-1 | 150. | 1159. | Zhang, Chen, et al., 1997 | 25. m/0.2 mm/0.33 μm, N2 |
Capillary | OV-1 | 150. | 1159. | Zhang, Chen, et al., 1997 | 25. m/0.2 mm/0.33 μm, N2 |
Packed | OV-101 | 120. | 1178. | Litvinenko, Isakova, et al., 1988 | He, Chromaton W AW; Column length: 2.4 m |
Capillary | SE-30 | 110. | 1134. | Bredael, 1982 | Column length: 100. m; Column diameter: 0.5 mm |
Capillary | SE-30 | 130. | 1147. | Bredael, 1982 | Column length: 100. m; Column diameter: 0.5 mm |
Capillary | SE-30 | 150. | 1159. | Bredael, 1982 | Column length: 100. m; Column diameter: 0.5 mm |
Capillary | SE-30 | 110. | 1163. | Bredael, 1982 | Column length: 100. m; Column diameter: 0.5 mm |
Capillary | SE-30 | 130. | 1176. | Bredael, 1982 | Column length: 100. m; Column diameter: 0.5 mm |
Capillary | SE-30 | 150. | 1190. | Bredael, 1982 | Column length: 100. m; Column diameter: 0.5 mm |
Capillary | SE-30 | 110. | 1168. | Bredael, 1982 | Column length: 100. m; Column diameter: 0.5 mm |
Capillary | SE-30 | 130. | 1182. | Bredael, 1982 | Column length: 100. m; Column diameter: 0.5 mm |
Capillary | SE-30 | 150. | 1196. | Bredael, 1982 | Column length: 100. m; Column diameter: 0.5 mm |
Capillary | SE-30 | 110. | 1174. | Bredael, 1982 | Column length: 100. m; Column diameter: 0.5 mm |
Capillary | SE-30 | 130. | 1188. | Bredael, 1982 | Column length: 100. m; Column diameter: 0.5 mm |

References

Zhang, Chen, et al., 1997
Zhang, M.; Chen, B.; Shen, S.; Chen, S.,
Compositional studies of high-temperature coal tar by g.c.-FT-i.r. analysis of middle oil fractions,
Fuel, 1997, 76, 5, 415-423, https://doi.org/10.1016/S0016-2361(97)85518-4
. [all data]
Litvinenko, Isakova, et al., 1988
Litvinenko, G.S.; Isakova, L.A.; Rubanyk, N.N.,
Quantitative correlation between structure of stereoisomeric saturated cyclic compounds and gas-chromatographic retention indices. I. Methysubstituted,
Izv. AN Kaz. SSR, Ser. Khim., 1988, 5, 54-66. [all data]
Bredael, 1982
Bredael, P.,
Retention indices of hydrocarbons on SE-30,
J. Hi. Res. Chromatogr. Chromatogr. Comm., 1982, 5, 6, 325-328, https://doi.org/10.1002/jhrc.1240050610
. [all data]