Methanone, (2-amino-5-chlorophenyl)(2-chlorophenyl)-
- Formula: C13H9Cl2NO
- Molecular weight: 266.123
- IUPAC Standard InChIKey: KWZYIAJRFJVQDO-UHFFFAOYSA-N
- CAS Registry Number: 2958-36-3
- Chemical structure:
View 3d structure (requires JavaScript / HTML 5) - Other names: 2-Amino-2',5-dichlorobenzophenone; Benzophenone, 2-amino-2',5-dichloro-; 2-Amino-5,2'-dichlor-benzophenone; 2-Amino-5,2'-dichlorobenzophenone

Kovats' RI, non-polar column, isothermal

Column type | Active phase | Temperature (C) | I | Reference | Comment |
---|---|---|---|---|---|
Capillary | BP-1 | 200. | 2145. | Japp, Garthwaite, et al., 1988 | 25. m/0.22 mm/0.25 μm, N2 |
Capillary | SPB-1 | 250. | 2191. | Lora-Tamayo, Rams, et al., 1986 | He; Column length: 25. m; Column diameter: 0.20 mm |
Packed | SE-30 | 220. | 2195. | Schütz, 1982 | N2 |

Normal alkane RI, non-polar column, custom temperature program

Column type | Active phase | I | Reference | Comment |
---|---|---|---|---|
Other | Methyl Silicone | 2195. | Ardrey and Moffat, 1981 | Program: not specified |

References

Japp, Garthwaite, et al., 1988
Japp, M.; Garthwaite, K.; Geeson, A.V.; Osselton, M.D.,
Collection of Analytical Data for Benzodiazepines and Benzophenones,
J. Chromatogr., 1988, 439, 2, 317-339, https://doi.org/10.1016/S0021-9673(01)83844-9
. [all data]
Lora-Tamayo, Rams, et al., 1986
Lora-Tamayo, C.; Rams, M.A.; Chacon, J.M.R.,
Gas Chromatographic Data for 187 Nitrogen- or Phosphorus-Containing Drugs and Metabolites of Toxicological Interest Analysed on Methyl Silicone Capillary Columns,
J. Chromatogr., 1986, 374, 73-85, https://doi.org/10.1016/S0378-4347(00)83254-5
. [all data]
Schütz, 1982
Schütz, H.,
Benzodiazepines, Springer-Verlag, New York, 1982, 438. [all data]
Ardrey and Moffat, 1981
Ardrey, R.E.; Moffat, A.C.,
Gas-liquid chromatographic retention indices of 1318 substances of toxicological interest on SE-30 or OV-1 stationary phase,
J. Chromatogr., 1981, 220, 3, 195-252, https://doi.org/10.1016/S0021-9673(00)81925-1
. [all data]