Cyclopentadecane
- Formula: C15H30
- Molecular weight: 210.3987
- IUPAC Standard InChIKey: SRONXYPFSAKOGH-UHFFFAOYSA-N
- CAS Registry Number: 295-48-7
- Chemical structure:
View 3d structure (requires JavaScript / HTML 5) - Other names: decylcyclopentane

Condensed phase thermochemistry data

Data compiled by: Hussein Y. Afeefy, Joel F. Liebman, and Stephen E. Stein
Quantity | Value | Units | Method | Reference | Comment |
---|---|---|---|---|---|
ΔcH°solid | -9814.0 ± 1.6 | kJ/mol | Ccb | Coops, Van Kamp, et al., 1960 | Reanalyzed by Cox and Pilcher, 1970, Original value = -9813.3 ± 1.6 kJ/mol; Corresponding ΔfHºsolid = -376.1 kJ/mol (simple calculation by NIST; no Washburn corrections) |

Phase change data

Data compiled as indicated in comments:
TRC - Thermodynamics Research Center, NIST Boulder Laboratories, Chris Muzny director
AC - William E. Acree, Jr., James S. Chickos
CAL - James S. Chickos, William E. Acree, Jr., Joel F. Liebman, Students of Chem 202 (Introduction to the Literature of Chemistry), University of Missouri -- St. Louis
Quantity | Value | Units | Method | Reference | Comment |
---|---|---|---|---|---|
Tfus | 336.6 | K | N/A | Drotloff and Moller, 1987 | Crystal phase 1 phase; Uncertainty assigned by TRC = 0.3 K; TRC |
Enthalpy of fusion
ΔfusH (kJ/mol) | Temperature (K) | Reference | Comment |
---|---|---|---|
8.5 | 336.6 | Drotloff and Möller, 1987 | AC |
Entropy of fusion
ΔfusS (J/mol*K) | Temperature (K) | Reference | Comment |
---|---|---|---|
40.46 | 210.1 | Drotloff and Moller, 1987 | CAL |
25.25 | 336.6 |

Van Den Dool and Kratz RI, polar column, custom temperature program

Column type | Active phase | I | Reference | Comment |
---|---|---|---|---|
Capillary | CP-Wax 52CB | 1550. | Romeo, Ziino, et al., 2007 | 60. m/0.25 mm/0.25 μm, He; Program: 45C(5min) => 10C/min => 80C => 2C/min => 240C |

Normal alkane RI, polar column, custom temperature program

Column type | Active phase | I | Reference | Comment |
---|---|---|---|---|
Capillary | PEG-20M Innowax | 1522. | Wang, Tian, et al., 2013 | 30. m/0.25 mm/0.25 μm, Nitrogen; Program: 50 0C (7 min) 20 0C/min -> 130 0C (1 min) 1 0C/min -> 150 0C 8 0C/min -> 190 0C (5 min) |

References

Coops, Van Kamp, et al., 1960
Coops, J.; Van Kamp, H.; Lambregts, W.A.; Visser, B.J.; Dekker, H.,
Thermal quantities of cycloparaffins. Part IV. Heats of combustion of cycloparaffins with 10-17 C atoms,
Rec. Trav. Chim. Pays/Bas, 1960, 79, 1226-1234. [all data]
Cox and Pilcher, 1970
Cox, J.D.; Pilcher, G.,
Thermochemistry of Organic and Organometallic Compounds, Academic Press, New York, 1970, 1-636. [all data]
Drotloff and Moller, 1987
Drotloff, H.; Moller, M.,
On the phase transitions of cycloalkanes,
Thermochim. Acta, 1987, 112, 1, 57, https://doi.org/10.1016/0040-6031(87)88079-6
. [all data]
Drotloff and Möller, 1987
Drotloff, Hansotto; Möller, Martin,
On the phase transitions of cycloalkanes,
Thermochimica Acta, 1987, 112, 1, 57-62, https://doi.org/10.1016/0040-6031(87)88079-6
. [all data]
Romeo, Ziino, et al., 2007
Romeo, V.; Ziino, M.; Giuffrrida, D.; Condurso, C.; Verzera, A.,
Flavour profile of capers (Capparis spinosa L.) from the Eolian Archipelago by HS-SPME/GC?MS,
Food Chem., 2007, 101, 3, 1272-1278, https://doi.org/10.1016/j.foodchem.2005.12.029
. [all data]
Wang, Tian, et al., 2013
Wang, G.-J.; Tian, L.; Fan, Y.-M.; Qi, M.-L.,
Headspace single drop microextraction gas chromatography mass spectrometry for the analysis of volatile compounds from herba Asari,
J. Anal. Methods in Chemistry, 2013, 1-6. [all data]