Cyclotetradecane
- Formula: C14H28
- Molecular weight: 196.3721
- IUPAC Standard InChIKey: KATXJJSCAPBIOB-UHFFFAOYSA-N
- CAS Registry Number: 295-17-0
- Chemical structure:
View 3d structure (requires JavaScript / HTML 5) - Permanent link for this species. Use this link for bookmarking this species for future reference.

Gas phase thermochemistry data

Data compiled by: Hussein Y. Afeefy, Joel F. Liebman, and Stephen E. Stein
Quantity | Value | Units | Method | Reference | Comment |
---|---|---|---|---|---|
ΔfH°gas | -239.2 ± 2.3 | kJ/mol | Ccb | Frisch, Bautista, et al., 1964 | Reanalyzed by Cox and Pilcher, 1970, Original value = -237.4 ± 3.2 kJ/mol; see Frisch, 1962 |

Condensed phase thermochemistry data

Data compiled by: Hussein Y. Afeefy, Joel F. Liebman, and Stephen E. Stein
Quantity | Value | Units | Method | Reference | Comment |
---|---|---|---|---|---|
ΔfH°solid | -372.1 ± 4.1 | kJ/mol | Ccb | Frisch, Bautista, et al., 1964 | see Frisch, 1962 |
Quantity | Value | Units | Method | Reference | Comment |
ΔcH°solid | -9138.7 ± 3.7 | kJ/mol | Ccb | Frisch, Bautista, et al., 1964 | see Frisch, 1962; Corresponding ΔfHºsolid = -372.1 kJ/mol (simple calculation by NIST; no Washburn corrections) |
ΔcH°solid | -9136.5 ± 1.3 | kJ/mol | Ccb | Coops, Van Kamp, et al., 1960 | Reanalyzed by Cox and Pilcher, 1970, Original value = -9135.7 ± 1.3 kJ/mol; Corresponding ΔfHºsolid = -374.26 kJ/mol (simple calculation by NIST; no Washburn corrections) |

Phase change data

Data compiled as indicated in comments:
TRC - Thermodynamics Research Center, NIST Boulder Laboratories, Chris Muzny director
AC - William E. Acree, Jr., James S. Chickos
DRB - Donald R. Burgess, Jr.
ALS - Hussein Y. Afeefy, Joel F. Liebman, and Stephen E. Stein
Quantity | Value | Units | Method | Reference | Comment |
---|---|---|---|---|---|
Tfus | 330. | K | N/A | Chickos, Hesse, et al., 1990 | Crystal phase 1 phase; Uncertainty assigned by TRC = 1. K; TRC |
Tfus | 329. | K | N/A | Drotloff and Moller, 1987 | Crystal phase 1 phase; Uncertainty assigned by TRC = 0.3 K; TRC |
Tfus | 325. | K | N/A | Sondheimer, Amiel, et al., 1957 | Uncertainty assigned by TRC = 3. K; TRC |
Quantity | Value | Units | Method | Reference | Comment |
ΔvapH° | 65.3 ± 0.2 | kJ/mol | N/A | Chickos, Hesse, et al., 1992 | AC |
Quantity | Value | Units | Method | Reference | Comment |
ΔsubH° | 95.6 | kJ/mol | CGC-DSC | Chickos, Hesse, et al., 1998 | AC |
ΔsubH° | 132.9 | kJ/mol | N/A | Frisch, Bautista, et al., 1964 | DRB |
Enthalpy of vaporization
ΔvapH (kJ/mol) | Temperature (K) | Reference | Comment |
---|---|---|---|
62.3 ± 0.2 | 343. | Chickos, Hesse, et al., 1992 | AC |
Enthalpy of sublimation
ΔsubH (kJ/mol) | Temperature (K) | Method | Reference | Comment |
---|---|---|---|---|
97.9 ± 1.7 | 310. | HSA | Chickos, Hesse, et al., 1992 | Based on data from 300. to 321. K.; AC |
134.8 ± 1.5 | 355. | V | Frisch, Bautista, et al., 1964 | see Frisch, 1962; ALS |
134.8 ± 1.5 | 301. | ME | Frisch, Bautista, et al., 1964 | Based on data from 295. to 307. K. See also Cox and Pilcher, 1970, 2.; AC |
89.3 ± 0.4 | 287. | TM | Engelsman, 1955 | Based on data from 285. to 290. K.; AC |
Enthalpy of fusion
ΔfusH (kJ/mol) | Temperature (K) | Reference | Comment |
---|---|---|---|
28.7 | 328. | Borgen and Dale, 1970 | AC |

Reaction thermochemistry data

Data compiled by: Hussein Y. Afeefy, Joel F. Liebman, and Stephen E. Stein
Individual Reactions
By formula: 4H2 + C14H20 = C14H28
Quantity | Value | Units | Method | Reference | Comment |
---|---|---|---|---|---|
ΔrH° | -524.7 ± 0.59 | kJ/mol | Chyd | Turner, Jarrett, et al., 1973 | liquid phase; solvent: Acetic acid |

Van Den Dool and Kratz RI, non-polar column, custom temperature program

Data compiled by: NIST Mass Spectrometry Data Center, William E. Wallace, director

Column type Capillary
Active phase SE-52
Column length (m) 30.
Carrier gas He
Substrate
Column diameter (mm) 0.32
Phase thickness (μm) 0.15
Program 45C => 1C/min => 100C => 5C/min => 250C(10min)
I 1677.
ReferenceBruni, Pellati, et al., 2005
Comment MSDC-RI

References

Frisch, Bautista, et al., 1964
Frisch, M.A.; Bautista, R.G.; Margrave, J.L.; Parsons, C.G.; Wotiz, J.H.,
Strain energies in hydrocarbons from heats of combustion. II. Concerning the possibility of a transannular interaction in 1,8-cyclotetradecadiyne,
J. Am. Chem. Soc., 1964, 86, 335-336. [all data]
Cox and Pilcher, 1970
Cox, J.D.; Pilcher, G.,
Thermochemistry of Organic and Organometallic Compounds, Academic Press, New York, 1970, 1-636. [all data]
Frisch, 1962
Frisch, M.A.,
A high precision calorimeter for ther measurement of small energy differences, Ph.D. Thesis for University of Wisconsin, 1962, 1-100. [all data]
Coops, Van Kamp, et al., 1960
Coops, J.; Van Kamp, H.; Lambregts, W.A.; Visser, B.J.; Dekker, H.,
Thermal quantities of cycloparaffins. Part IV. Heats of combustion of cycloparaffins with 10-17 C atoms,
Rec. Trav. Chim. Pays/Bas, 1960, 79, 1226-1234. [all data]
Chickos, Hesse, et al., 1990
Chickos, J.S.; Hesse, D.G.; Liebman, J.F.,
Estimating entropies and enthalpies of fusion of hydrocarbons,
J. Org. Chem., 1990, 55, 3833-40. [all data]
Drotloff and Moller, 1987
Drotloff, H.; Moller, M.,
On the phase transitions of cycloalkanes,
Thermochim. Acta, 1987, 112, 1, 57, https://doi.org/10.1016/0040-6031(87)88079-6
. [all data]
Sondheimer, Amiel, et al., 1957
Sondheimer, F.; Amiel, Y.; Wolovsky, R.,
Unsaturated Macrocyclic Compounds IV. The Oxidation of Terminal Diacetylenes to Macrocyclic Tetraacetaylenes,
J. Am. Chem. Soc., 1957, 79, 6263. [all data]
Chickos, Hesse, et al., 1992
Chickos, James S.; Hesse, Donald G.; Panshin, Sandra Y.; Rogers, Donald W.; Saunders, Martin; Uffer, Philip M.; Liebman, Joel F.,
The strain energy of cyclotetradecane is small,
J. Org. Chem., 1992, 57, 6, 1897-1899, https://doi.org/10.1021/jo00032a052
. [all data]
Chickos, Hesse, et al., 1998
Chickos, James; Hesse, Donald; Hosseini, Sarah; Nichols, Gary; Webb, Paul,
Sublimation enthalpies at 298.15K using correlation gas chromatography and differential scanning calorimetry measurements,
Thermochimica Acta, 1998, 313, 2, 101-110, https://doi.org/10.1016/S0040-6031(97)00432-2
. [all data]
Cox and Pilcher, 1970, 2
Cox, J.D.; Pilcher, G.,
Thermochemistry of Organic and Organometallic Compounds, Academic Press Inc., London, 1970, 643. [all data]
Engelsman, 1955
Engelsman, J.J.,
, Ph.D. Thesis, Vrije Universiteit Te Amsterdam, 1955. [all data]
Borgen and Dale, 1970
Borgen, Gerd; Dale, Johannes,
Conformational analysis of 14- and 16-membered rings,
J. Chem. Soc. D, 1970, 20, 1340b, https://doi.org/10.1039/c2970001340b
. [all data]
Turner, Jarrett, et al., 1973
Turner, R.B.; Jarrett, A.D.; Goebel, P.; Mallon, B.J.,
Heats of hydrogenation. 9. Cyclic acetylenes and some miscellaneous olefins,
J. Am. Chem. Soc., 1973, 95, 790-792. [all data]