1,3,7,9 Tetraoxacyclododecane
- Formula: C8H16O4
- Molecular weight: 176.2102
- IUPAC Standard InChIKey: CWZGOKFRNJKAMG-UHFFFAOYSA-N
- CAS Registry Number: 294-84-8
- Chemical structure:
View 3d structure (requires JavaScript / HTML 5) - Permanent link for this species. Use this link for bookmarking this species for future reference.

Reaction thermochemistry data

Data compiled by: Hussein Y. Afeefy, Joel F. Liebman, and Stephen E. Stein
Individual Reactions
By formula: 2C4H8O2 = C8H16O4
Quantity | Value | Units | Method | Reference | Comment |
---|---|---|---|---|---|
ΔrH° | -9.9 ± 2.8 | kJ/mol | Eqk | Szymanski, 1991 | solid phase |

References

Szymanski, 1991
Szymanski, R.,
Equilibrium between 1,3 and its cyclooligomers,
Makromol. Chem., 1991, 192, 2961-2968. [all data]