Diethyl cyanophosphonate
- Formula: C5H10NO3P
- Molecular weight: 163.1116
- IUPAC Standard InChIKey: ZWWWLCMDTZFSOO-UHFFFAOYSA-N
- CAS Registry Number: 2942-58-7
- Chemical structure:
View 3d structure (requires JavaScript / HTML 5) - Other names: Phosphorocyanidic acid, diethyl ester; Phosphorocyanidic acid, O,O-diethyl ester; Diethoxy-phosphoryl cyanide; Diethylcyanophosphate; Diethyl cyanophosphosphonate; Diethyl phosphorocyanidate; Diethyl cyanidophosphate; Diethylphosphoryl cyanide

Van Den Dool and Kratz RI, non-polar column, temperature ramp

Column type | Active phase | I | Reference | Comment |
---|---|---|---|---|
Capillary | SE-54 | 1046. | Kostiainen, 2000 | 25. m/0.32 mm/0.25 μm, He, 40. C @ 1. min, 10. K/min, 280. C @ 10. min |

References

Kostiainen, 2000
Kostiainen, O.,
Gas Chromatography in Screening of Chemicals Related to the Chemical Weapons Convention
in Encyclopedia of Analytical Chemistry, Meyers, R.A., ed(s)., John Wiley Sons Ltd, Chichester, 2000, 963-979. [all data]