(S)-(+)-1-Iodo-2-methylbutane
- Formula: C5H11I
- Molecular weight: 198.0453
- IUPAC Standard InChIKey: RHBHXHXNWHTGSO-RXMQYKEDSA-N
- CAS Registry Number: 29394-58-9
- Chemical structure:
View 3d structure (requires JavaScript / HTML 5) - Stereoisomers:

Phase change data

Data compiled by: Robert L. Brown and Stephen E. Stein
Quantity | Value | Units | Method | Reference | Comment |
---|---|---|---|---|---|
Tboil | 421.2 | K | N/A | Weast and Grasselli, 1989 |

References

Weast and Grasselli, 1989
CRC Handbook of Data on Organic Compounds, 2nd Editon, Weast,R.C and Grasselli, J.G., ed(s)., CRC Press, Inc., Boca Raton, FL, 1989, 1. [all data]