Benzoic acid, p-[[(dimethylamino)methylene]amino]-, methyl ester
- Formula: C11H14N2O2
- Molecular weight: 206.2411
- IUPAC Standard InChIKey: NQVUPXYJLAGUBE-UHFFFAOYSA-N
- CAS Registry Number: 29390-16-7
- Chemical structure:
View 3d structure (requires JavaScript / HTML 5) - Other names: 4-Aminobenzoic acid, N-dimethylaminomethylene-, methyl ester

Van Den Dool and Kratz RI, non-polar column, custom temperature program

Column type | Active phase | I | Reference | Comment |
---|---|---|---|---|
Capillary | VF-5MS | 1910. | Tretyakov, 2011 | 30. m/0.25 mm/0.25 μm, He; Program: Multi-step temperature program; T(initial)=60C; T(final)=270C |

References

Tretyakov, 2011
Tretyakov, K.V.,
Retention Data. NIST Mass Spectrometry Data Center., NIST Mass Spectrometry Data Center, 2011. [all data]