1,4-Butanediol, 2-methyl-
- Formula: C5H12O2
- Molecular weight: 104.1476
- IUPAC Standard InChIKey: MWCBGWLCXSUTHK-UHFFFAOYSA-N
- CAS Registry Number: 2938-98-9
- Chemical structure:
View 3d structure (requires JavaScript / HTML 5) - Stereoisomers:
- Other names: 2-methylbutane-1,4-diol

Phase change data

Data compiled by: Thermodynamics Research Center, NIST Boulder Laboratories, Chris Muzny director
Quantity | Value | Units | Method | Reference | Comment |
---|---|---|---|---|---|
Tboil | 466.15 | K | N/A | Kato, 1962 | Uncertainty assigned by TRC = 3. K |
Tboil | 398.15 | K | N/A | Harries, 1911 | Uncertainty assigned by TRC = 2. K |

References

Kato, 1962
Kato,
Formation of a Micelle-Like Structure in Aqueous Solutions of Glycols,
Chem. Pharm. Bull., 1962, 10, 771. [all data]
Harries, 1911
Harries, C.D.,
Hydrocarbons of the Butane Series and Preparation of Artificial Caoutchoue from Them,
Justus Liebigs Ann. Chem., 1911, 383, 157. [all data]