Octane, 1-propoxy-
- Formula: C11H24O
- Molecular weight: 172.3077
- IUPAC Standard InChIKey: KPFDWNLAMXJSNJ-UHFFFAOYSA-N
- CAS Registry Number: 29379-41-7
- Chemical structure:
View 3d structure (requires JavaScript / HTML 5) - Other names: Ether, octyl propyl; n-Octyl propyl ether; 1-Propoxyoctane; Octyl propyl ether; Propyl octyl ether

Phase change data

Data compiled as indicated in comments:
TRC - Thermodynamics Research Center, NIST Boulder Laboratories, Chris Muzny director
AC - William E. Acree, Jr., James S. Chickos
Quantity | Value | Units | Method | Reference | Comment |
---|---|---|---|---|---|
Tboil | 477.2 | K | N/A | Devaney and Panian, 1953 | Uncertainty assigned by TRC = 1. K; TRC |
Quantity | Value | Units | Method | Reference | Comment |
Tfus | 227.2 | K | N/A | Devaney and Panian, 1953 | Uncertainty assigned by TRC = 0.8 K; TRC |
Quantity | Value | Units | Method | Reference | Comment |
ΔvapH° | 58.8 ± 0.1 | kJ/mol | C | Kusano, 1985 | AC |

References

Devaney and Panian, 1953
Devaney, L.W.; Panian, G.W.,
Preparation and properties of some octyl ethers,
J. Am. Chem. Soc., 1953, 75, 4836-7. [all data]
Kusano, 1985
Kusano, Kazuhito,
Micro conduction calorimeters to measure enthalpies of vaporization,
Thermochimica Acta, 1985, 88, 1, 109-120, https://doi.org/10.1016/0040-6031(85)85418-6
. [all data]