2,5-Hexanediol
- Formula: C6H14O2
- Molecular weight: 118.1742
- IUPAC Standard InChIKey: OHMBHFSEKCCCBW-UHFFFAOYSA-N
- CAS Registry Number: 2935-44-6
- Chemical structure:
View 3d structure (requires JavaScript / HTML 5) - Other names: Diisopropanol; 2,5-Dihydroxyhexane; Hexan-2,5-diol; hexane-2,5-diol

Phase change data

Data compiled as indicated in comments:
BS - Robert L. Brown and Stephen E. Stein
TRC - Thermodynamics Research Center, NIST Boulder Laboratories, Chris Muzny director
Quantity | Value | Units | Method | Reference | Comment |
---|---|---|---|---|---|
Tboil | 490.2 | K | N/A | Aldrich Chemical Company Inc., 1990 | BS |
Tboil | 363.15 | K | N/A | Gagnaire and Monzeglio, 1965 | Uncertainty assigned by TRC = 1. K; TRC |
Tboil | 493.95 | K | N/A | Mellan, 1962 | Uncertainty assigned by TRC = 2. K; TRC |
Tboil | 480.15 | K | N/A | Wurtz, 1864 | Uncertainty assigned by TRC = 3. K; TRC |

Henry's Law data

Data compiled by: Rolf Sander
Henry's Law constant (water solution)
kH(T) = k°H exp(d(ln(kH))/d(1/T) ((1/T) - 1/(298.15 K)))
k°H = Henry's law constant for solubility in water at 298.15 K (mol/(kg*bar))
d(ln(kH))/d(1/T) = Temperature dependence constant (K)
k°H (mol/(kg*bar)) | d(ln(kH))/d(1/T) (K) | Method | Reference | Comment |
---|---|---|---|---|
2.0×10+6 | E | N/A | Value obtained by missing citation using the group contribution method. |

References

Aldrich Chemical Company Inc., 1990
Aldrich Chemical Company Inc.,
Catalog Handbook of Fine Chemicals, Aldrich Chemical Company, Inc., Milwaukee WI, 1990, 1. [all data]
Gagnaire and Monzeglio, 1965
Gagnaire, D.; Monzeglio, P.,
Stereochemical Studies in the Tetraahydrofuran Series V. Configuration of Symmetrical Substituted Dihydrofuran and Tetrahydrofuran,
Bull. Soc. Chim. Fr., 1965, 1965, 474. [all data]
Mellan, 1962
Mellan, I.,
Polyhydric Alcohols, Spartan Books: Washington, DC, 1962. [all data]
Wurtz, 1864
Wurtz, A.,
Ann. Chim. Phys., 1864, [4] 3, 129. [all data]