Heptasulfur imide

Phase change data

Data compiled by: William E. Acree, Jr., James S. Chickos

Enthalpy of fusion

ΔfusH (kJ/mol) Temperature (K) Reference
18.83386.7Hamada, Kudo, et al., 1975

References

Hamada, Kudo, et al., 1975
Hamada, Shuichi; Kudo, Yoshiyuki; Kawano, Masako, The Solubilities and the Solubility Parameter of Heptasulfur Imide, Bull. Chem. Soc. Jpn., 1975, 48, 10, 2963-2964, https://doi.org/10.1246/bcsj.48.2963 . [all data]