Phenol, 2,4,6-tris(1-methylethyl)-
- Formula: C15H24O
- Molecular weight: 220.3505
- IUPAC Standard InChIKey: HVFKKINZIWVNQG-UHFFFAOYSA-N
- CAS Registry Number: 2934-07-8
- Chemical structure:
View 3d structure (requires JavaScript / HTML 5) - Other names: 2,4,6-Triisopropylphenol

Gas phase thermochemistry data

Data compiled by: Hussein Y. Afeefy, Joel F. Liebman, and Stephen E. Stein
Quantity | Value | Units | Method | Reference | Comment |
---|---|---|---|---|---|
ΔfH°gas | -333.0 ± 3.1 | kJ/mol | Eqk | Nesterova, Pimerzin, et al., 1989 | Author was aware that data differs from previously reported values; Isomerization |
ΔfH°gas | -290.9 | kJ/mol | Ccb | Bertholon, Giray, et al., 1971 |

Condensed phase thermochemistry data

Data compiled by: Hussein Y. Afeefy, Joel F. Liebman, and Stephen E. Stein
Quantity | Value | Units | Method | Reference | Comment |
---|---|---|---|---|---|
ΔfH°liquid | -390. | kJ/mol | Ccb | Bertholon, Giray, et al., 1971 | |
Quantity | Value | Units | Method | Reference | Comment |
ΔcH°liquid | -8942.5 | kJ/mol | Ccb | Bertholon, Giray, et al., 1971 | Corresponding ΔfHºliquid = -390. kJ/mol (simple calculation by NIST; no Washburn corrections) |

Phase change data

Data compiled as indicated in comments:
ALS - Hussein Y. Afeefy, Joel F. Liebman, and Stephen E. Stein
DRB - Donald R. Burgess, Jr.
Quantity | Value | Units | Method | Reference | Comment |
---|---|---|---|---|---|
ΔvapH° | 99.20 | kJ/mol | C | Bertholon, Giray, et al., 1971 | ALS |
ΔvapH° | 99.1 | kJ/mol | N/A | Bertholon, Giray, et al., 1971 | DRB |

Reaction thermochemistry data

Data compiled by: Hussein Y. Afeefy, Joel F. Liebman, and Stephen E. Stein
Individual Reactions
By formula: C15H24O + C9H12O = C12H18O + C12H18O
Quantity | Value | Units | Method | Reference | Comment |
---|---|---|---|---|---|
ΔrH° | 0.0 ± 0.84 | kJ/mol | Eqk | Nesterova, Pilyshchikov, et al., 1983 | liquid phase; CG |

Normal alkane RI, non-polar column, custom temperature program

Column type | Active phase | I | Reference | Comment |
---|---|---|---|---|
Capillary | TR-5 MS | 1516. | Kurashov, Krylova, et al., 2013 | 15. m/0.25 mm/0.25 μm, Helium; Program: 35 0C (3 min) 2 0C/min -> 60 0C (3 min) 2 0C/min -> 80 0C (3 min) 4 0C/min -> 120 0C (3 min) 5 0C/min -> 150 0C (3 mion) 15 0C/min -> 240 0C (10 min) |

References

Nesterova, Pimerzin, et al., 1989
Nesterova, T.N.; Pimerzin, A.A.; Rozhnov, A.M.; Karlina, T.N.,
Equilibria for the isomerization of (secondary-alkyl)phenols and cyclohexylphenols,
J. Chem. Thermodyn., 1989, 21, 385-395. [all data]
Bertholon, Giray, et al., 1971
Bertholon, G.; Giray, M.; Perrin, R.; Vincent-Falquet-Berny, M.F.,
No. 532. - Etude physicochimique des phenols. OX. - Ethanlpies de combustion et energies de resonance des alcoyl et aryphenols,
Bull. Soc. Chim. France, 1971, 3180-3187. [all data]
Nesterova, Pilyshchikov, et al., 1983
Nesterova, T.N.; Pilyshchikov, V.A.; Rozhnov, A.M.,
Chemical Equilibrium in the system isopropylphenols-phenol,
J. Appl. Chem. USSR, 1983, 56, 1257-1261. [all data]
Kurashov, Krylova, et al., 2013
Kurashov, E.A.; Krylova, Yu.V.; Mitrukova, G.G.,
Variations in component composition of essential oil of Potamogeton pusillus (Potamogetonaceae) dirong vegetation,
Plant Resources (Rastitel'nye Resursy), 2013, 000-000. [all data]