4-n-Propylacetophenone
- Formula: C11H14O
- Molecular weight: 162.2283
- IUPAC Standard InChIKey: ZNBVIYMIVFKTIW-UHFFFAOYSA-N
- CAS Registry Number: 2932-65-2
- Chemical structure:
View 3d structure (requires JavaScript / HTML 5) - Other names: p-Propylacetophenone; p-n-Propylacetophenone; 4'-Propylacetophenone; Ethanone, 1-(4-propylphenyl)-; 1-(4-propylphenyl)ethan-1-one

Phase change data

Data compiled by: Robert L. Brown and Stephen E. Stein
Reduced pressure boiling point
Tboil (K) | Pressure (bar) | Reference |
---|---|---|
428. to 431. | 0.024 | Frinton Laboratories Inc., 1986 |

References

Frinton Laboratories Inc., 1986
Frinton Laboratories Inc.,
Catalog Number 11, Frinton Laboratories Inc., Vineland, NJ, 1986, 99. [all data]