sec-Pentylbenzene
- Formula: C11H16
- Molecular weight: 148.2447
- IUPAC Standard InChIKey: LTHAIAJHDPJXLG-UHFFFAOYSA-N
- CAS Registry Number: 29316-05-0
- Chemical structure:
View 3d structure (requires JavaScript / HTML 5) - Species with the same structure:
- Other names: Sec-amylbenzene

Phase change data

Antoine Equation Parameters
log10(P) = A − (B / (T + C))
P = vapor pressure (atm)
T = temperature (K)
View plot Requires a JavaScript / HTML 5 canvas capable browser.
Temperature (K) | A | B | C | Reference | Comment |
---|---|---|---|---|---|
302. to 466. | 4.51960 | 1901.952 | -45.153 | Stull, 1947 | Coefficents calculated by NIST from author's data. |

References

Stull, 1947
Stull, Daniel R.,
Vapor Pressure of Pure Substances. Organic and Inorganic Compounds,
Ind. Eng. Chem., 1947, 39, 4, 517-540, https://doi.org/10.1021/ie50448a022
. [all data]