trans-Polypentenamer

Phase change data

Data compiled by: Eugene S. Domalski and Elizabeth D. Hearing

Enthalpy of fusion

ΔfusH (kJ/mol) Temperature (K) Reference Comment
8.900310.Lebedev, Rabinovich, et al., 1977

Entropy of fusion

ΔfusS (J/mol*K) Temperature (K) Reference Comment
28.7310.Lebedev, Rabinovich, et al., 1977

References

Lebedev, Rabinovich, et al., 1977
Lebedev, B.V.; Rabinovich, I.B.; Lityagov, V.Ya., Influence of the stereoisomerism of polypentenamer on its thermodynamic properties, Dokl. Akad. Nauk, 1977, SSSR 237, 877-880. [all data]