Naphthalene, (1-methylethyl)-
- Formula: C13H14
- Molecular weight: 170.2503
- IUPAC Standard InChIKey: PMPBFICDXLLSRM-UHFFFAOYSA-N
- CAS Registry Number: 29253-36-9
- Chemical structure:
View 3d structure (requires JavaScript / HTML 5) - Species with the same structure:
- Other names: isopropylnaphthalene

Phase change data

Data compiled by: Thermodynamics Research Center, NIST Boulder Laboratories, Chris Muzny director
Quantity | Value | Units | Method | Reference | Comment |
---|---|---|---|---|---|
Tboil | 541.3 | K | N/A | Mantyukov, Loginova, et al., 1974 | Uncertainty assigned by TRC = 0.4 K |

Lee's RI, non-polar column, custom temperature program

Data compiled by: NIST Mass Spectrometry Data Center, William E. Wallace, director

Column type Capillary
Active phase SE-54
Column length (m) 15.
Carrier gas He
Substrate
Column diameter (mm) 0.25
Phase thickness (μm) 0.25
Program 125 0C (15 min) 1 0C/min -> 131 0C 4 0C/min -> 247 0C 8 0C/min -> 280 0C (15 min)
I 248.9
ReferencePeterman and Delfino, 1990
Comment MSDC-RI

References

Mantyukov, Loginova, et al., 1974
Mantyukov, G.D.; Loginova, M.A.; Bychkov, B.N.; Rozhkov, S.S.,
Liquid-vapor equilibrium in the system isopropylnaphthalene + 2-naphthol,
J. Appl. Chem. USSR (Engl. Transl.), 1974, 47, 2665-6. [all data]