1,1-di-o-Tolylethylene
- Formula: C16H16
- Molecular weight: 208.2982
- IUPAC Standard InChIKey: MUZMRKGPXHDTOF-UHFFFAOYSA-N
- CAS Registry Number: 2919-19-9
- Chemical structure:
View 3d structure (requires JavaScript / HTML 5) - Species with the same structure:

Condensed phase thermochemistry data

Data compiled by: Hussein Y. Afeefy, Joel F. Liebman, and Stephen E. Stein
Quantity | Value | Units | Method | Reference | Comment |
---|---|---|---|---|---|
ΔcH°solid | -8671.8 ± 2.0 | kJ/mol | Ccb | Coops, Hoijtink, et al., 1953 | Reanalyzed by Cox and Pilcher, 1970, Original value = -8671. ± 2. kJ/mol; Corresponding ΔfHºsolid = 89.00 kJ/mol (simple calculation by NIST; no Washburn corrections) |
ΔcH°solid | -8531. ± 2. | kJ/mol | Ccb | Coops, Hoijtink, et al., 1953, 2 | Corresponding ΔfHºsolid = -52. kJ/mol (simple calculation by NIST; no Washburn corrections) |

Phase change data

Data compiled by: Robert L. Brown and Stephen E. Stein
Reduced pressure boiling point
Tboil (K) | Pressure (bar) | Reference |
---|---|---|
389. to 393. | 0.001 | Frinton Laboratories Inc., 1986 |

References

Coops, Hoijtink, et al., 1953
Coops, J.; Hoijtink, G.J.; Kramer, Th.J.E.; Faber, A.C.,
Thermochemical investigations on arylethenes. II. Heats of combustion of some para and orthotolylethenes and phenylbutadienes,
Rec. Trav. Chim. Pays/Bas, 1953, 72, 765. [all data]
Cox and Pilcher, 1970
Cox, J.D.; Pilcher, G.,
Thermochemistry of Organic and Organometallic Compounds, Academic Press, New York, 1970, 1-636. [all data]
Coops, Hoijtink, et al., 1953, 2
Coops, J.; Hoijtink, G.J.; Kramer, Th.J.E.; Faber, A.C.,
Thermochemical investigations on arylethynes I. Heats of combustion of some diarylethynes,
Rec. Trav. Chim. Pays/Bas, 1953, 72, 781. [all data]
Frinton Laboratories Inc., 1986
Frinton Laboratories Inc.,
Catalog Number 11, Frinton Laboratories Inc., Vineland, NJ, 1986, 99. [all data]