1-Hepten-3-one

Van Den Dool and Kratz RI, non-polar column, custom temperature program

View large format table.

Column type Active phase I Reference Comment
CapillarySE-54888.Zimmermann and Schieberle, 200030. m/0.25 mm/0.25 μm, He; Program: 35C(2min) => 40C/min => 60C => 6C/min => 180C 20C/min => 240C(10min)
CapillarySE-54886.Buettner and Schieberle, 199930. m/0.32 mm/0.25 μm, He; Program: 35C (2min) => 40C/min => 50C (2min) => 6C/min => 180C => 10C/min => 230C (10min)

Van Den Dool and Kratz RI, polar column, custom temperature program

View large format table.

Column type Active phase I Reference Comment
CapillaryFFAP1200.Zimmermann and Schieberle, 200030. m/0.25 mm/0.25 μm, He; Program: 35C(2min) => 40C/min => 60C => 6C/min => 180C 20C/min => 240C(10min)
CapillaryFFAP1190.Buettner and Schieberle, 199930. m/0.32 mm/0.25 μm, He; Program: 35C (2min) => 40C/min => 60C (2min) => 6C/min => 180C => 10C/min => 230C (10min)

Normal alkane RI, non-polar column, temperature ramp

View large format table.

Column type Active phase I Reference Comment
CapillaryRTX-5 MS876.Watcharananun, Cadwallader, et al., 200930. m/0.25 mm/0.50 μm, Helium, 35. C @ 5. min, 6. K/min, 225. C @ 10. min
CapillaryDB-5862.Rouseff, Jella, et al., 200130. m/0.32 mm/0.5 μm, 6. K/min; Tstart: 35. C; Tend: 275. C
CapillaryMethyl Silicone856.Bravo, Hotchkiss, et al., 1992He, 35. C @ 3. min, 4. K/min; Column length: 17. m; Column diameter: 0.32 mm; Tend: 225. C

Normal alkane RI, polar column, temperature ramp

View large format table.

Column type Active phase I Reference Comment
CapillaryStabilwax1196.Watcharananun, Cadwallader, et al., 200930. m/0.25 mm/0.50 μm, Helium, 35. C @ 5. min, 6. K/min, 225. C @ 10. min

References

Zimmermann and Schieberle, 2000
Zimmermann, M.; Schieberle, P., Important odorants of sweet bell pepper powder (Capsicum annuum cv. annuum): differences between samples of Hungarian and Morrocan origin, Eur. Food Res. Technol., 2000, 211, 3, 175-180, https://doi.org/10.1007/s002170050019 . [all data]

Buettner and Schieberle, 1999
Buettner, A.; Schieberle, P., Characterization of the most odor-active volatiles in fresh, hand squeezed juice of grapefruit (Citrus paradise Macfayden), J. Agric. Food Chem., 1999, 47, 12, 5189-5193, https://doi.org/10.1021/jf990071l . [all data]

Watcharananun, Cadwallader, et al., 2009
Watcharananun, W.; Cadwallader, K.R.; Huangrak, K.; Kim, H.; Lorjaroenphon, Y., Identification of predominant odorants in Thai desserts flavored by smoking with Tian Op, a traditional Thai scented candle, J. Agric. Food Chem., 2009, 57, 3, 996-1005, https://doi.org/10.1021/jf802674c . [all data]

Rouseff, Jella, et al., 2001
Rouseff, R.; Jella, P.; Bazemore, R.; Yang, J.-J., Aroma active internal standards for gas chromatography-olfactometry of grapefruit juices, Am. Chem. Soc. Symp. Ser., 2001, 782, 73-87. [all data]

Bravo, Hotchkiss, et al., 1992
Bravo, A.; Hotchkiss, J.H.; Acree, T.E., Identification of ordor-active compounds resulting from thermal oxidation of polyethylene, J. Agric. Food Chem., 1992, 40, 10, 1881-1885, https://doi.org/10.1021/jf00022a031 . [all data]