6-Octen-1-yn-3-ol, 3,7-dimethyl-
- Formula: C10H16O
- Molecular weight: 152.2334
- IUPAC Standard InChIKey: YWTIDNZYLFTNQQ-UHFFFAOYSA-N
- CAS Registry Number: 29171-20-8
- Chemical structure:
View 3d structure (requires JavaScript / HTML 5) - Other names: 3,7-Dimethyl-6-octen-1-yn-3-ol; 2,7-Dimethyl-7-octen-5-yn-4-ol; Dehydrolinalool; Linalool, dehydro-; Dehydro-β-linalool; 3,7-dimethyloct-6-en-1-yn-3-ol

Condensed phase thermochemistry data

Data compiled by: Eugene S. Domalski and Elizabeth D. Hearing
Constant pressure heat capacity of liquid
Cp,liquid (J/mol*K) | Temperature (K) | Reference | Comment |
---|---|---|---|
385.2 | 313.55 | Baglay, Gurariy, et al., 1988 | T = 270 to 340 K. Unsmoothed experimental datum. |

Phase change data

Data compiled by: William E. Acree, Jr., James S. Chickos
Enthalpy of vaporization
ΔvapH (kJ/mol) | Temperature (K) | Method | Reference | Comment |
---|---|---|---|---|
52.1 | 421. | EB | Zhu, Li, et al., 2001 | Based on data from 406. to 471. K. |
50.4 ± 0.1 | 407. | N/A | Baglay, Gurariy, et al., 1988 | Based on data from 369. to 445. K. |

Kovats' RI, non-polar column, isothermal

Column type | Active phase | Temperature (C) | I | Reference | Comment |
---|---|---|---|---|---|
Capillary | SE-30 | 100. | 1068.4 | Tudor, 1997 | 40. m/0.35 mm/0.35 μm |
Capillary | OV-101 | 170. | 1072. | Gribanova, Kharitonov, et al., 1990 | N2; Column length: 50. m; Column diameter: 0.26 mm |

Kovats' RI, polar column, isothermal

Column type | Active phase | Temperature (C) | I | Reference | Comment |
---|---|---|---|---|---|
Capillary | PEG-20M | 170. | 1617. | Gribanova, Kharitonov, et al., 1990, 2 | N2; Column length: 50. m; Column diameter: 0.27 mm |

Van Den Dool and Kratz RI, non-polar column, temperature ramp

Column type | Active phase | I | Reference | Comment |
---|---|---|---|---|
Capillary | SPB-1 | 1116. | Moldão-Martins, Beirão-da-Costa, et al., 2004 | 30. m/0.2 mm/0.2 μm, He, 3. K/min, 220. C @ 15. min; Tstart: 70. C |

Normal alkane RI, non-polar column, custom temperature program

Column type | Active phase | I | Reference | Comment |
---|---|---|---|---|
Capillary | DB-5 | 1091. | Nivinsliene, Butkiene, et al., 2007 | 50. m/0.32 mm/0.25 μm, Helium; Program: 60 0C (1 min) 5 0C/min -> 160 0C 10 0C/min -> 250 0C |
Capillary | Polydimethyl siloxanes | 1072. | Zenkevich, 1997 | Program: not specified |

References

Baglay, Gurariy, et al., 1988
Baglay, A.K.; Gurariy, L.L.; Kuleshov, G.G.,
Physical properties of compounds used in vitamin synthesis,
J. Chem. Eng. Data, 1988, 33, 512-518. [all data]
Zhu, Li, et al., 2001
Zhu, Longhua; Li, Haoran; Wang, Congmin; Han, Shijun,
Vapor-Liquid Equilibria for the Binary Mixtures Dehydrolinalool + 1-Propanol and Dehydrolinalool + 1-Butanol,
J. Chem. Eng. Data, 2001, 46, 5, 1231-1234, https://doi.org/10.1021/je010041q
. [all data]
Tudor, 1997
Tudor, E.,
Temperature dependence of the retention index for perfumery compounds on a SE-30 glass capillary column. I. Linear equations,
J. Chromatogr. A, 1997, 779, 1-2, 287-297, https://doi.org/10.1016/S0021-9673(97)00453-6
. [all data]
Gribanova, Kharitonov, et al., 1990
Gribanova, S.V.; Kharitonov, Yu.Ya.; Dzhabarov, D.N.; Rudenko, B.A.; Yanotovskii, M.T.,
Gas-chromatographic identification of impurities in intermediate products of the synthesis of vitamin E based on the additive scheme of calculation of retention indices,
Zh. Anal. Khim., 1990, 45, 5, 1009-1016. [all data]
Gribanova, Kharitonov, et al., 1990, 2
Gribanova, S.V.; Kharitonov, Yu.Ya.; Dzhabarov, D.N.; Rudenko, B.A.; Yanotovskii, M.T.,
Investigation of the gas-chromatographic behaviour of intermediate products of vitamin E synthesis and their structural analogs on various stationary phases for the identification of impurities by their retention indices,
Zh. Anal. Khim., 1990, 45, 8, 1561-1567. [all data]
Moldão-Martins, Beirão-da-Costa, et al., 2004
Moldão-Martins, M.; Beirão-da-Costa, S.; Neves, C.; Cavaleiro, C.; Salgueiro, L.; Beirão-da-Costa, M.L.,
Olive oil flavoured by the essential oils of Mentha × piperita and Thymus mastichina L.,
Food Qual. Pref., 2004, 15, 5, 447-452, https://doi.org/10.1016/j.foodqual.2003.08.001
. [all data]
Nivinsliene, Butkiene, et al., 2007
Nivinsliene, O.; Butkiene, R.; Gudalevic, A.; Mockute, D.; Meskauskiene, V.; Grigaliunaite, B.,
Influence of urban environment on chemical composition of Tilia cordata essential oil,
Chemija, 2007, 18, 1, 44-49. [all data]
Zenkevich, 1997
Zenkevich, I.G.,
Analytical Parameters of Components of Essential Oils for their Chromatographic and Chromato-Spectral Identificaiton. Oxsigenated derivatives of Mono- and Sesquiterpene Hydrocarbons,
Rastit, Resursy (Rus.), 1997, 33, 1, 16-28. [all data]