Tetra(p-bromophenyl)porphyrin
- Formula: C44H26Br4N4
- Molecular weight: 930.320
- IUPAC Standard InChIKey: ANWXWWSYNQLVED-LWQDQPMZSA-N
- CAS Registry Number: 29162-73-0
- Chemical structure:

Condensed phase thermochemistry data

Data compiled by: Hussein Y. Afeefy, Joel F. Liebman, and Stephen E. Stein
Quantity | Value | Units | Method | Reference | Comment |
---|---|---|---|---|---|
ΔfH°solid | 180.3 ± 3.0 | kcal/mol | Ccb | Wu, Xu, et al., 1989 | see Gu, Wu, et al., 1989 and Li, Luo, et al., 1992 |
Quantity | Value | Units | Method | Reference | Comment |
ΔcH°solid | -5206.6 ± 2.7 | kcal/mol | Ccb | Wu, Xu, et al., 1989 | see Gu, Wu, et al., 1989 and Li, Luo, et al., 1992 |

Phase change data

Data compiled by: Hussein Y. Afeefy, Joel F. Liebman, and Stephen E. Stein
Quantity | Value | Units | Method | Reference | Comment |
---|---|---|---|---|---|
ΔsubH° | 67.88 | kcal/mol | E | Wu, Xu, et al., 1989 | see Gu, Wu, et al., 1989 and Li, Luo, et al., 1992 |

References

Wu, Xu, et al., 1989
Wu, D.; Xu, G.; Qu, S.; Xue, R.; Gu, C.; Zhang, F.,
Standard enthalpies of combustion and formation of porphyrin derivatives,
Thermochim. Acta, 1989, 154, 233-245. [all data]
Gu, Wu, et al., 1989
Gu, C.; Wu, D.; Qu, S.,
Studies on thermochemistry of porphyrins. III. Standard energies of combustion and standard enthalpies of formation of tetranitrophenylporphyrin and tetrapyridinylporphyrin,
Wuli Huaxue Xuebao, 1989, 5, 95-98. [all data]
Li, Luo, et al., 1992
Li, L.; Luo, M.; Qu, S.; Huang, S.; Yan, X.,
Studies on structure and properties of tetraphenylporphyrin and its derivatives. (III). Standard molar enthalpies of sublimation and formation, enthalpies of strain and resonance energy,
Gaodeng Xuexiao Huaxue Xuebao, 1992, 13, 509-512. [all data]